OCamllabs icon Home|Differences with the last checks|Previous runs


Building on asteria.caelum.ci.dev

(from ocaml/opam:debian-unstable)
Unable to find image 'ocaml/opam:debian-unstable' locally
debian-unstable: Pulling from ocaml/opam
Digest: sha256:867738023289fd26cdb69fad77687cf4ed3a8bf60dcddabdf3cc53c705746fd2
Status: Downloaded newer image for ocaml/opam:debian-unstable
2025-08-07 08:43.07 ---> using "0acd5aeaa8f7bc314514d9795d14a7f12ec72a6a5b11c5904350189734c6859b" from cache

/: (user (uid 1000) (gid 1000))

/: (env OPAMPRECISETRACKING 1)

/: (env OPAMUTF8 never)

/: (env OPAMEXTERNALSOLVER builtin-0install)

/: (env OPAMCRITERIA +removed)

/: (env CI true)

/: (env OPAM_HEALTH_CHECK_CI true)

/: (run (shell "sudo ln -f /usr/bin/opam-dev /usr/bin/opam"))
2025-08-07 08:43.07 ---> using "40df4fa4cdfc68a5fa7a326047e82a7adc5df52b8059d4a7b745bdd50aad56e7" from cache

/: (run (network host)
        (shell "rm -rf ~/opam-repository && git clone -q 'https://github.com/ocaml/opam-repository' ~/opam-repository && git -C ~/opam-repository checkout -q 06a1064b82e87c7ef006235ec98f1c89487892c9"))
2025-08-07 08:43.07 ---> using "190c02cbe0dbf4a8b0af5361aa9e25640f87291c4fe861cc6cf855e0fda3a8c0" from cache

/: (run (shell "rm -rf ~/.opam && opam init -ya --bare --config ~/.opamrc-sandbox ~/opam-repository"))
Configuring from /home/opam/.opamrc-sandbox, then /home/opam/.opamrc, and finally from built-in defaults.
Checking for available remotes: rsync and local, git.
  - you won't be able to use mercurial repositories unless you install the hg command on your system.
  - you won't be able to use darcs repositories unless you install the darcs command on your system.


<><> Fetching repository information ><><><><><><><><><><><><><><><><><><><><><>
[default] Initialised

User configuration:
  ~/.profile is already up-to-date.
[NOTE] Make sure that ~/.profile is well sourced in your ~/.bashrc.

2025-08-07 08:43.07 ---> using "012c52728bded521bf1d53a4382a5dac829cfe1a6f3ed7b53cc733c53b2d91cb" from cache

/: (run (cache (opam-archives (target /home/opam/.opam/download-cache)))
        (network host)
        (shell "sudo apt update && sudo apt install autoconf -y"))

WARNING: apt does not have a stable CLI interface. Use with caution in scripts.

Get:1 http://deb.debian.org/debian unstable InRelease [216 kB]
Get:2 http://deb.debian.org/debian unstable/main amd64 Packages.diff/Index [63.6 kB]
Get:3 http://deb.debian.org/debian unstable/main amd64 Packages T-2025-08-07-0205.44-F-2025-08-02-0804.37.pdiff [69.1 kB]
Get:3 http://deb.debian.org/debian unstable/main amd64 Packages T-2025-08-07-0205.44-F-2025-08-02-0804.37.pdiff [69.1 kB]
Fetched 348 kB in 2s (215 kB/s)
Reading package lists...
Building dependency tree...
Reading state information...
4 packages can be upgraded. Run 'apt list --upgradable' to see them.

WARNING: apt does not have a stable CLI interface. Use with caution in scripts.

Reading package lists...
Building dependency tree...
Reading state information...
Installing:
  autoconf

Installing dependencies:
  automake  autotools-dev  m4

Suggested packages:
  autoconf-archive  gnu-standards  autoconf-doc  libtool  gettext  m4-doc

Summary:
  Upgrading: 0, Installing: 4, Removing: 0, Not Upgrading: 4
  Download size: 1710 kB
  Space needed: 5051 kB / 293 GB available

Get:1 http://deb.debian.org/debian unstable/main amd64 m4 amd64 1.4.19-8 [294 kB]
Get:2 http://deb.debian.org/debian unstable/main amd64 autoconf all 2.72-3.1 [494 kB]
Get:3 http://deb.debian.org/debian unstable/main amd64 autotools-dev all 20240727.1 [60.2 kB]
Get:4 http://deb.debian.org/debian unstable/main amd64 automake all 1:1.17-4 [862 kB]
Fetched 1710 kB in 0s (28.1 MB/s)
Selecting previously unselected package m4.
(Reading database ... 
(Reading database ... 5%
(Reading database ... 10%
(Reading database ... 15%
(Reading database ... 20%
(Reading database ... 25%
(Reading database ... 30%
(Reading database ... 35%
(Reading database ... 40%
(Reading database ... 45%
(Reading database ... 50%
(Reading database ... 55%
(Reading database ... 60%
(Reading database ... 65%
(Reading database ... 70%
(Reading database ... 75%
(Reading database ... 80%
(Reading database ... 85%
(Reading database ... 90%
(Reading database ... 95%
(Reading database ... 100%
(Reading database ... 20685 files and directories currently installed.)
Preparing to unpack .../archives/m4_1.4.19-8_amd64.deb ...
Unpacking m4 (1.4.19-8) ...
Selecting previously unselected package autoconf.
Preparing to unpack .../autoconf_2.72-3.1_all.deb ...
Unpacking autoconf (2.72-3.1) ...
Selecting previously unselected package autotools-dev.
Preparing to unpack .../autotools-dev_20240727.1_all.deb ...
Unpacking autotools-dev (20240727.1) ...
Selecting previously unselected package automake.
Preparing to unpack .../automake_1%3a1.17-4_all.deb ...
Unpacking automake (1:1.17-4) ...
Setting up m4 (1.4.19-8) ...
Setting up autotools-dev (20240727.1) ...
Setting up autoconf (2.72-3.1) ...
Setting up automake (1:1.17-4) ...
update-alternatives: using /usr/bin/automake-1.17 to provide /usr/bin/automake (automake) in auto mode
2025-08-07 08:43.07 ---> using "159374d4dfbeb7f87b486ade5afe9a00b3d6b0bdba42573a1887cdb5e30fe45b" from cache

/: (run (network host)
        (shell "git clone -q 'https://github.com/oxcaml/opam-repository' ~/'oxcaml' && git -C ~/'oxcaml' checkout -q 29656e8e76b4441b5b62db11d35d193e380298ca"))
2025-08-07 08:43.07 ---> using "b5848cf3bbbc0c4981e5d5e3d9bcec3b4c6b4225e188081cd30294eec97db7b4" from cache

/: (run (shell "opam repository add --dont-select 'oxcaml' ~/'oxcaml'"))
[oxcaml] Initialised
2025-08-07 08:43.07 ---> using "c846a1cc387dcbe1a71e6838f59ad7ff1920eabe18952f84a40fd0b2a4641443" from cache

/: (run (cache (opam-archives (target /home/opam/.opam/download-cache)))
        (network host)
        (shell "opam switch create --repositories=oxcaml,default '5.2.0+flambda2' '5.2.0+ox'"))

<><> Installing new switch packages <><><><><><><><><><><><><><><><><><><><><><>
Switch invariant: ["ocaml-variants" {= "5.2.0+ox"}]

<><> Processing actions <><><><><><><><><><><><><><><><><><><><><><><><><><><><>
-> retrieved ocaml-config.3  (cached)
-> installed base-bigarray.base
-> installed base-threads.base
-> installed base-unix.base
-> installed ocaml-options-vanilla.1
-> installed conf-autoconf.0.2
-> installed conf-which.1
-> retrieved ocaml-variants.5.2.0+ox  (https://github.com/oxcaml/oxcaml/archive/refs/tags/5.2.0minus-11-opam.tar.gz)
-> installed ocaml-variants.5.2.0+ox
-> installed ocaml-config.3
-> installed ocaml.5.2.0
-> installed base-domains.base
-> installed base-nnp.base
Done.
# To update the current shell environment, run: eval $(opam env --switch=5.2.0+flambda2)
2025-08-07 08:43.07 ---> using "059e4c8d9fde813aed5ba328af1b91f6cd5242b6bc0b704a2be07cd5d14bb4e8" from cache

/: (run (network host)
        (shell "opam update --depexts"))
+ /usr/bin/sudo "apt-get" "update"
- Hit:1 http://deb.debian.org/debian unstable InRelease
- Reading package lists...
2025-08-07 08:43.07 ---> using "7b9500581933009c35fa6ed9ef22a28eda258d356f0b06a637af33ddf697e0af" from cache

/: (run (cache (opam-archives (target /home/opam/.opam/download-cache)))
        (network host)
        (shell  "opam remove -y torch.v0.18~preview.130.36+326\
               \nopam install -vy torch.v0.18~preview.130.36+326\
               \nres=$?\
               \nif [ $res = 31 ]; then\
               \n    if opam show -f x-ci-accept-failures: torch.v0.18~preview.130.36+326 | grep -q 'debian-unstable'; then\
               \n        echo \"This package failed and has been disabled for CI using the 'x-ci-accept-failures' field.\"\
               \n        exit 69\
               \n    fi\
               \nfi \
               \n\
               \n\
               \nexit $res"))
[NOTE] torch.v0.18~preview.130.36+326 is not installed.

Nothing to do.
The following actions will be performed:
=== install 90 packages
  - install backoff                     0.1.1+ox                 [required by portable]
  - install base                        v0.18~preview.130.36+326 [required by torch]
  - install base_bigstring              v0.18~preview.130.36+326 [required by core]
  - install base_quickcheck             v0.18~preview.130.36+326 [required by core]
  - install basement                    v0.18~preview.130.36+326 [required by base]
  - install bigarray-compat             1.1.0                    [required by ctypes]
  - install bin_prot                    v0.18~preview.130.36+326 [required by core]
  - install capitalization              v0.18~preview.130.36+326 [required by ppx_string_conv]
  - install conf-bash                   1                        [required by ppxlib_ast]
  - install conf-libffi                 2.0.0                    [required by ctypes-foreign]
  - install conf-pkg-config             4                        [required by ctypes-foreign]
  - install core                        v0.18~preview.130.36+326 [required by torch]
  - install core_kernel                 v0.18~preview.130.36+326 [required by core_unix]
  - install core_unix                   v0.18~preview.130.36+326 [required by torch]
  - install csexp                       1.5.2                    [required by dune-configurator]
  - install ctypes                      0.23.0                   [required by torch]
  - install ctypes-foreign              0.23.0                   [required by torch]
  - install dune                        3.19.1                   [required by torch]
  - install dune-configurator           3.19.1                   [required by torch]
  - install expect_test_helpers_core    v0.18~preview.130.36+326 [required by core_unix]
  - install fieldslib                   v0.18~preview.130.36+326 [required by core]
  - install int_repr                    v0.18~preview.130.36+326 [required by base_bigstring, core_kernel]
  - install integers                    0.7.0                    [required by ctypes]
  - install jane-street-headers         v0.18~preview.130.36+326 [required by core, core_unix]
  - install jst-config                  v0.18~preview.130.36+326 [required by core, core_unix]
  - install num                         1.6                      [required by sexplib]
  - install ocaml-compiler-libs         v0.17.0+ox               [required by torch]
  - install ocaml_intrinsics_kernel     v0.18~preview.130.36+326 [required by base]
  - install parsexp                     v0.18~preview.130.36+326 [required by core]
  - install portable                    v0.18~preview.130.36+326 [required by core]
  - install ppx_assert                  v0.18~preview.130.36+326 [required by core]
  - install ppx_base                    v0.18~preview.130.36+326 [required by base, core]
  - install ppx_bench                   v0.18~preview.130.36+326 [required by torch]
  - install ppx_bin_prot                v0.18~preview.130.36+326 [required by ppx_jane]
  - install ppx_cold                    v0.18~preview.130.36+326 [required by base]
  - install ppx_compare                 v0.18~preview.130.36+326 [required by ppx_diff, ppx_base, string_dict]
  - install ppx_custom_printf           v0.18~preview.130.36+326 [required by ppx_jane]
  - install ppx_derivers                1.2.1                    [required by ppxlib]
  - install ppx_diff                    v0.18~preview.130.36+326 [required by core, core_unix]
  - install ppx_disable_unused_warnings v0.18~preview.130.36+326 [required by ppx_jane]
  - install ppx_enumerate               v0.18~preview.130.36+326 [required by ppx_base, ppx_diff]
  - install ppx_expect                  v0.18~preview.130.36+326 [required by core]
  - install ppx_fields_conv             v0.18~preview.130.36+326 [required by ppx_jane]
  - install ppx_fixed_literal           v0.18~preview.130.36+326 [required by ppx_jane]
  - install ppx_globalize               v0.18~preview.130.36+326 [required by ppx_base]
  - install ppx_hash                    v0.18~preview.130.36+326 [required by base, core]
  - install ppx_helpers                 v0.18~preview.130.36+326 [required by ppx_sexp_conv]
  - install ppx_here                    v0.18~preview.130.36+326 [required by ppx_jane]
  - install ppx_ignore_instrumentation  v0.18~preview.130.36+326 [required by ppx_jane]
  - install ppx_inline_test             v0.18~preview.130.36+326 [required by torch]
  - install ppx_jane                    v0.18~preview.130.36+326 [required by torch]
  - install ppx_let                     v0.18~preview.130.36+326 [required by ppx_jane]
  - install ppx_log                     v0.18~preview.130.36+326 [required by ppx_jane]
  - install ppx_module_timer            v0.18~preview.130.36+326 [required by ppx_jane]
  - install ppx_optcomp                 v0.18~preview.130.36+326 [required by core, core_unix]
  - install ppx_optional                v0.18~preview.130.36+326 [required by ppx_jane]
  - install ppx_pipebang                v0.18~preview.130.36+326 [required by ppx_jane]
  - install ppx_sexp_conv               v0.18~preview.130.36+326 [required by core]
  - install ppx_sexp_message            v0.18~preview.130.36+326 [required by core]
  - install ppx_sexp_value              v0.18~preview.130.36+326 [required by ppx_jane]
  - install ppx_shorthand               v0.18~preview.130.36+326 [required by ppx_base]
  - install ppx_stable                  v0.18~preview.130.36+326 [required by ppx_jane]
  - install ppx_stable_witness          v0.18~preview.130.36+326 [required by core, core_unix]
  - install ppx_string                  v0.18~preview.130.36+326 [required by torch]
  - install ppx_string_conv             v0.18~preview.130.36+326 [required by ppx_jane]
  - install ppx_template                v0.18~preview.130.36+326 [required by ppx_base]
  - install ppx_tydi                    v0.18~preview.130.36+326 [required by ppx_jane]
  - install ppx_typed_fields            v0.18~preview.130.36+326 [required by ppx_jane]
  - install ppx_typerep_conv            v0.18~preview.130.36+326 [required by ppx_jane]
  - install ppx_var_name                v0.18~preview.130.36+326 [required by ppx_jane]
  - install ppx_variants_conv           v0.18~preview.130.36+326 [required by ppx_jane]
  - install ppxlib                      0.33.0+ox                [required by base]
  - install ppxlib_ast                  0.33.0+ox                [required by ppxlib]
  - install ppxlib_jane                 v0.18~preview.130.36+326 [required by base]
  - install re                          1.13.2                   [required by expect_test_helpers_core]
  - install seq                         base                     [required by re]
  - install sexp_pretty                 v0.18~preview.130.36+326 [required by expect_test_helpers_core]
  - install sexplib                     v0.18~preview.130.36+326 [required by core, core_unix]
  - install sexplib0                    v0.18~preview.130.36+326 [required by base]
  - install spawn                       v0.17.0                  [required by core_unix]
  - install splittable_random           v0.18~preview.130.36+326 [required by core]
  - install stdio                       v0.18~preview.130.36+326 [required by torch]
  - install stdlib-shims                0.3.0                    [required by integers]
  - install string_dict                 v0.18~preview.130.36+326 [required by core]
  - install time_now                    v0.18~preview.130.36+326 [required by core]
  - install torch                       v0.18~preview.130.36+326
  - install typerep                     v0.18~preview.130.36+326 [required by core]
  - install univ_map                    v0.18~preview.130.36+326 [required by core]
  - install uopt                        v0.18~preview.130.36+326 [required by core, core_unix]
  - install variantslib                 v0.18~preview.130.36+326 [required by core]

The following system packages will first need to be installed:
    libffi-dev pkg-config

<><> Handling external dependencies <><><><><><><><><><><><><><><><><><><><><><>

opam believes some required external dependencies are missing. opam can:
> 1. Run apt-get to install them (may need root/sudo access)
  2. Display the recommended apt-get command and wait while you run it manually (e.g. in another terminal)
  3. Continue anyway, and, upon success, permanently register that this external dependency is present, but not detectable
  4. Abort the installation

[1/2/3/4] 1

+ /usr/bin/sudo "apt-get" "install" "-qq" "-yy" "libffi-dev" "pkg-config"
- Selecting previously unselected package libffi-dev:amd64.
- (Reading database ... 
(Reading database ... 5%
(Reading database ... 10%
(Reading database ... 15%
(Reading database ... 20%
(Reading database ... 25%
(Reading database ... 30%
(Reading database ... 35%
(Reading database ... 40%
(Reading database ... 45%
(Reading database ... 50%
(Reading database ... 55%
(Reading database ... 60%
(Reading database ... 65%
(Reading database ... 70%
(Reading database ... 75%
(Reading database ... 80%
(Reading database ... 85%
(Reading database ... 90%
(Reading database ... 95%
(Reading database ... 100%
(Reading database ... 21005 files and directories currently installed.)
- Preparing to unpack .../libffi-dev_3.4.8-2_amd64.deb ...
- Unpacking libffi-dev:amd64 (3.4.8-2) ...
- Selecting previously unselected package libpkgconf3:amd64.
- Preparing to unpack .../libpkgconf3_1.8.1-4_amd64.deb ...
- Unpacking libpkgconf3:amd64 (1.8.1-4) ...
- Selecting previously unselected package pkgconf-bin.
- Preparing to unpack .../pkgconf-bin_1.8.1-4_amd64.deb ...
- Unpacking pkgconf-bin (1.8.1-4) ...
- Selecting previously unselected package pkgconf:amd64.
- Preparing to unpack .../pkgconf_1.8.1-4_amd64.deb ...
- Unpacking pkgconf:amd64 (1.8.1-4) ...
- Selecting previously unselected package pkg-config:amd64.
- Preparing to unpack .../pkg-config_1.8.1-4_amd64.deb ...
- Unpacking pkg-config:amd64 (1.8.1-4) ...
- Setting up libffi-dev:amd64 (3.4.8-2) ...
- Setting up libpkgconf3:amd64 (1.8.1-4) ...
- Setting up pkgconf-bin (1.8.1-4) ...
- Setting up pkgconf:amd64 (1.8.1-4) ...
- Setting up pkg-config:amd64 (1.8.1-4) ...
- Processing triggers for libc-bin (2.41-11) ...

<><> Processing actions <><><><><><><><><><><><><><><><><><><><><><><><><><><><>
Processing  1/267: [backoff.0.1.1+ox: extract]
Processing  2/267: [backoff.0.1.1+ox: extract] [base.v0.18~preview.130.36+326: extract]
Processing  3/267: [backoff.0.1.1+ox: extract] [base.v0.18~preview.130.36+326: extract] [base_bigstring.v0.18~preview.130.36+326: extract]
-> retrieved backoff.0.1.1+ox  (cached)
Processing  3/267: [base.v0.18~preview.130.36+326: extract] [base_bigstring.v0.18~preview.130.36+326: extract]
Processing  4/267: [base.v0.18~preview.130.36+326: extract] [base_bigstring.v0.18~preview.130.36+326: extract] [base_quickcheck.v0.18~preview.130.36+326: extract]
-> retrieved base.v0.18~preview.130.36+326  (cached)
Processing  4/267: [base_bigstring.v0.18~preview.130.36+326: extract] [base_quickcheck.v0.18~preview.130.36+326: extract]
Processing  5/267: [base_bigstring.v0.18~preview.130.36+326: extract] [base_quickcheck.v0.18~preview.130.36+326: extract] [basement.v0.18~preview.130.36+326: extract]
-> retrieved base_bigstring.v0.18~preview.130.36+326  (cached)
Processing  5/267: [base_quickcheck.v0.18~preview.130.36+326: extract] [basement.v0.18~preview.130.36+326: extract]
Processing  6/267: [base_quickcheck.v0.18~preview.130.36+326: extract] [basement.v0.18~preview.130.36+326: extract] [bigarray-compat.1.1.0: extract]
-> retrieved base_quickcheck.v0.18~preview.130.36+326  (cached)
Processing  6/267: [basement.v0.18~preview.130.36+326: extract] [bigarray-compat.1.1.0: extract]
Processing  7/267: [basement.v0.18~preview.130.36+326: extract] [bigarray-compat.1.1.0: extract] [bin_prot.v0.18~preview.130.36+326: extract]
-> retrieved basement.v0.18~preview.130.36+326  (cached)
Processing  7/267: [bigarray-compat.1.1.0: extract] [bin_prot.v0.18~preview.130.36+326: extract]
Processing  8/267: [bigarray-compat.1.1.0: extract] [bin_prot.v0.18~preview.130.36+326: extract] [capitalization.v0.18~preview.130.36+326: extract]
-> retrieved bigarray-compat.1.1.0  (cached)
Processing  8/267: [bin_prot.v0.18~preview.130.36+326: extract] [capitalization.v0.18~preview.130.36+326: extract]
Processing  9/267: [bin_prot.v0.18~preview.130.36+326: extract] [capitalization.v0.18~preview.130.36+326: extract]
Processing 10/267: [bin_prot.v0.18~preview.130.36+326: extract] [capitalization.v0.18~preview.130.36+326: extract]
Processing 11/267: [bin_prot.v0.18~preview.130.36+326: extract] [capitalization.v0.18~preview.130.36+326: extract]
Processing 12/267: [bin_prot.v0.18~preview.130.36+326: extract] [capitalization.v0.18~preview.130.36+326: extract] [core.v0.18~preview.130.36+326: extract]
Processing 13/267: [bin_prot.v0.18~preview.130.36+326: extract] [capitalization.v0.18~preview.130.36+326: extract] [core.v0.18~preview.130.36+326: extract] [conf-bash: bash]
Processing 14/267: [bin_prot.v0.18~preview.130.36+326: extract] [capitalization.v0.18~preview.130.36+326: extract] [core.v0.18~preview.130.36+326: extract] [conf-bash: bash] [conf-pkg-config: pkg-config]
-> retrieved bin_prot.v0.18~preview.130.36+326  (cached)
Processing 14/267: [capitalization.v0.18~preview.130.36+326: extract] [core.v0.18~preview.130.36+326: extract] [conf-bash: bash] [conf-pkg-config: pkg-config]
Processing 15/267: [capitalization.v0.18~preview.130.36+326: extract] [core.v0.18~preview.130.36+326: extract] [core_kernel.v0.18~preview.130.36+326: extract] [conf-bash: bash] [conf-pkg-config: pkg-config]
-> retrieved capitalization.v0.18~preview.130.36+326  (cached)
Processing 15/267: [core.v0.18~preview.130.36+326: extract] [core_kernel.v0.18~preview.130.36+326: extract] [conf-bash: bash] [conf-pkg-config: pkg-config]
Processing 16/267: [core.v0.18~preview.130.36+326: extract] [core_kernel.v0.18~preview.130.36+326: extract] [core_unix.v0.18~preview.130.36+326: extract] [conf-bash: bash] [conf-pkg-config: pkg-config]
-> retrieved core.v0.18~preview.130.36+326  (cached)
Processing 16/267: [core_kernel.v0.18~preview.130.36+326: extract] [core_unix.v0.18~preview.130.36+326: extract] [conf-bash: bash] [conf-pkg-config: pkg-config]
Processing 17/267: [core_kernel.v0.18~preview.130.36+326: extract] [core_unix.v0.18~preview.130.36+326: extract] [csexp.1.5.2: extract] [conf-bash: bash] [conf-pkg-config: pkg-config]
+ /home/opam/.opam/opam-init/hooks/sandbox.sh "build" "bash" "--version" (CWD=/home/opam/.opam/5.2.0+flambda2/.opam-switch/build/conf-bash.1)
- GNU bash, version 5.2.37(1)-release (x86_64-pc-linux-gnu)
- Copyright (C) 2022 Free Software Foundation, Inc.
- License GPLv3+: GNU GPL version 3 or later <http://gnu.org/licenses/gpl.html>
- 
- This is free software; you are free to change and redistribute it.
- There is NO WARRANTY, to the extent permitted by law.
-> compiled  conf-bash.1
Processing 17/267: [core_kernel.v0.18~preview.130.36+326: extract] [core_unix.v0.18~preview.130.36+326: extract] [csexp.1.5.2: extract] [conf-pkg-config: pkg-config]
-> installed conf-bash.1
Processing 18/267: [core_kernel.v0.18~preview.130.36+326: extract] [core_unix.v0.18~preview.130.36+326: extract] [csexp.1.5.2: extract] [conf-pkg-config: pkg-config]
+ /home/opam/.opam/opam-init/hooks/sandbox.sh "build" "pkg-config" "--help" (CWD=/home/opam/.opam/5.2.0+flambda2/.opam-switch/build/conf-pkg-config.4)
- usage: pkgconf [OPTIONS] [LIBRARIES]
- 
- basic options:
- 
-   --help                            this message
-   --about                           print pkgconf version and license to stdout
-   --version                         print supported pkg-config version to stdout
-   --atleast-pkgconfig-version       check whether or not pkgconf is compatible
-                                     with a specified pkg-config version
-   --errors-to-stdout                print all errors on stdout instead of stderr
-   --print-errors                    ensure all errors are printed
-   --short-errors                    be less verbose about some errors
-   --silence-errors                  explicitly be silent about errors
-   --list-all                        list all known packages
-   --list-package-names              list all known package names
-   --simulate                        simulate walking the calculated dependency graph
-   --no-cache                        do not cache already seen packages when
-                                     walking the dependency graph
-   --log-file=filename               write an audit log to a specified file
-   --with-path=path                  adds a directory to the search path
-   --define-prefix                   override the prefix variable with one that is guessed based on
-                                     the location of the .pc file
-   --dont-define-prefix              do not override the prefix variable under any circumstances
-   --prefix-variable=varname         sets the name of the variable that pkgconf considers
-                                     to be the package prefix
-   --relocate=path                   relocates a path and exits (mostly for testsuite)
-   --dont-relocate-paths             disables path relocation support
- 
- cross-compilation personality support:
- 
-   --personality=triplet|filename    sets the personality to 'triplet' or a file named 'filename'
-   --dump-personality                dumps details concerning selected personality
- 
- checking specific pkg-config database entries:
- 
-   --atleast-version                 require a specific version of a module
-   --exact-version                   require an exact version of a module
-   --max-version                     require a maximum version of a module
-   --exists                          check whether or not a module exists
-   --uninstalled                     check whether or not an uninstalled module will be used
-   --no-uninstalled                  never use uninstalled modules when satisfying dependencies
-   --no-provides                     do not use 'provides' rules to resolve dependencies
-   --maximum-traverse-depth          maximum allowed depth for dependency graph
-   --static                          be more aggressive when computing dependency graph
-                                     (for static linking)
-   --shared                          use a simplified dependency graph (usually default)
-   --pure                            optimize a static dependency graph as if it were a normal
-                                     dependency graph
-   --env-only                        look only for package entries in PKG_CONFIG_PATH
-   --ignore-conflicts                ignore 'conflicts' rules in modules
-   --validate                        validate specific .pc files for correctness
- 
- querying specific pkg-config database fields:
- 
-   --define-variable=varname=value   define variable 'varname' as 'value'
-   --variable=varname                print specified variable entry to stdout
-   --cflags                          print required CFLAGS to stdout
-   --cflags-only-I                   print required include-dir CFLAGS to stdout
-   --cflags-only-other               print required non-include-dir CFLAGS to stdout
-   --libs                            print required linker flags to stdout
-   --libs-only-L                     print required LDPATH linker flags to stdout
-   --libs-only-l                     print required LIBNAME linker flags to stdout
-   --libs-only-other                 print required other linker flags to stdout
-   --print-requires                  print required dependency frameworks to stdout
-   --print-requires-private          print required dependency frameworks for static
-                                     linking to stdout
-   --print-provides                  print provided dependencies to stdout
-   --print-variables                 print all known variables in module to stdout
-   --digraph                         print entire dependency graph in graphviz 'dot' format
-   --keep-system-cflags              keep -I/usr/include entries in cflags output
-   --keep-system-libs                keep -L/lib:/lib/i386-linux-gnu:/lib/x86_64-linux-gnu:/lib/x86_64-linux-gnux32:/lib32:/libx32:/usr/lib:/usr/lib/i386-linux-gnu:/usr/lib/x86_64-linux-gnu:/usr/lib/x86_64-linux-gnux32:/usr/lib32:/usr/libx32 entries in libs output
-   --path                            show the exact filenames for any matching .pc files
-   --modversion                      print the specified module's version to stdout
-   --internal-cflags                 do not filter 'internal' cflags from output
- 
- filtering output:
- 
-   --msvc-syntax                     print translatable fragments in MSVC syntax
-   --fragment-filter=types           filter output fragments to the specified types
- 
- report bugs to <https://github.com/pkgconf/pkgconf/issues/new>.
-> compiled  conf-pkg-config.4
Processing 18/267: [core_kernel.v0.18~preview.130.36+326: extract] [core_unix.v0.18~preview.130.36+326: extract] [csexp.1.5.2: extract]
-> installed conf-pkg-config.4
Processing 19/267: [core_kernel.v0.18~preview.130.36+326: extract] [core_unix.v0.18~preview.130.36+326: extract] [csexp.1.5.2: extract]
Processing 20/267: [core_kernel.v0.18~preview.130.36+326: extract] [core_unix.v0.18~preview.130.36+326: extract] [csexp.1.5.2: extract] [conf-libffi: pkg-config libffi]
-> retrieved core_kernel.v0.18~preview.130.36+326  (cached)
Processing 20/267: [core_unix.v0.18~preview.130.36+326: extract] [csexp.1.5.2: extract] [conf-libffi: pkg-config libffi]
Processing 21/267: [core_unix.v0.18~preview.130.36+326: extract] [csexp.1.5.2: extract] [ctypes.0.23.0, ctypes-foreign.0.23.0: extract] [conf-libffi: pkg-config libffi]
-> retrieved core_unix.v0.18~preview.130.36+326  (cached)
Processing 21/267: [csexp.1.5.2: extract] [ctypes.0.23.0, ctypes-foreign.0.23.0: extract] [conf-libffi: pkg-config libffi]
Processing 22/267: [csexp.1.5.2: extract] [ctypes.0.23.0, ctypes-foreign.0.23.0: extract] [dune.3.19.1, dune-configurator.3.19.1: extract] [conf-libffi: pkg-config libffi]
-> retrieved csexp.1.5.2  (cached)
Processing 22/267: [ctypes.0.23.0, ctypes-foreign.0.23.0: extract] [dune.3.19.1, dune-configurator.3.19.1: extract] [conf-libffi: pkg-config libffi]
Processing 23/267: [ctypes.0.23.0, ctypes-foreign.0.23.0: extract] [dune.3.19.1, dune-configurator.3.19.1: extract] [expect_test_helpers_core.v0.18~preview.130.36+326: extract] [conf-libffi: pkg-config libffi]
+ /home/opam/.opam/opam-init/hooks/sandbox.sh "build" "pkg-config" "libffi" (CWD=/home/opam/.opam/5.2.0+flambda2/.opam-switch/build/conf-libffi.2.0.0)
-> compiled  conf-libffi.2.0.0
Processing 23/267: [ctypes.0.23.0, ctypes-foreign.0.23.0: extract] [dune.3.19.1, dune-configurator.3.19.1: extract] [expect_test_helpers_core.v0.18~preview.130.36+326: extract]
-> installed conf-libffi.2.0.0
Processing 24/267: [ctypes.0.23.0, ctypes-foreign.0.23.0: extract] [dune.3.19.1, dune-configurator.3.19.1: extract] [expect_test_helpers_core.v0.18~preview.130.36+326: extract]
-> retrieved ctypes.0.23.0, ctypes-foreign.0.23.0  (cached)
Processing 24/267: [dune.3.19.1, dune-configurator.3.19.1: extract] [expect_test_helpers_core.v0.18~preview.130.36+326: extract]
Processing 25/267: [dune.3.19.1, dune-configurator.3.19.1: extract] [expect_test_helpers_core.v0.18~preview.130.36+326: extract] [fieldslib.v0.18~preview.130.36+326: extract]
-> retrieved expect_test_helpers_core.v0.18~preview.130.36+326  (cached)
Processing 25/267: [dune.3.19.1, dune-configurator.3.19.1: extract] [fieldslib.v0.18~preview.130.36+326: extract]
Processing 26/267: [dune.3.19.1, dune-configurator.3.19.1: extract] [fieldslib.v0.18~preview.130.36+326: extract] [int_repr.v0.18~preview.130.36+326: extract]
-> retrieved fieldslib.v0.18~preview.130.36+326  (cached)
Processing 26/267: [dune.3.19.1, dune-configurator.3.19.1: extract] [int_repr.v0.18~preview.130.36+326: extract]
Processing 27/267: [dune.3.19.1, dune-configurator.3.19.1: extract] [int_repr.v0.18~preview.130.36+326: extract] [integers.0.7.0: extract]
-> retrieved int_repr.v0.18~preview.130.36+326  (cached)
Processing 27/267: [dune.3.19.1, dune-configurator.3.19.1: extract] [integers.0.7.0: extract]
Processing 28/267: [dune.3.19.1, dune-configurator.3.19.1: extract] [integers.0.7.0: extract] [jane-street-headers.v0.18~preview.130.36+326: extract]
-> retrieved integers.0.7.0  (cached)
Processing 28/267: [dune.3.19.1, dune-configurator.3.19.1: extract] [jane-street-headers.v0.18~preview.130.36+326: extract]
Processing 29/267: [dune.3.19.1, dune-configurator.3.19.1: extract] [jane-street-headers.v0.18~preview.130.36+326: extract] [jst-config.v0.18~preview.130.36+326: extract]
-> retrieved jane-street-headers.v0.18~preview.130.36+326  (cached)
Processing 29/267: [dune.3.19.1, dune-configurator.3.19.1: extract] [jst-config.v0.18~preview.130.36+326: extract]
Processing 30/267: [dune.3.19.1, dune-configurator.3.19.1: extract] [jst-config.v0.18~preview.130.36+326: extract] [num.1.6: extract]
-> retrieved jst-config.v0.18~preview.130.36+326  (cached)
Processing 30/267: [dune.3.19.1, dune-configurator.3.19.1: extract] [num.1.6: extract]
Processing 31/267: [dune.3.19.1, dune-configurator.3.19.1: extract] [num.1.6: extract] [ocaml-compiler-libs.v0.17.0+ox: extract]
-> retrieved ocaml-compiler-libs.v0.17.0+ox  (cached)
Processing 31/267: [dune.3.19.1, dune-configurator.3.19.1: extract] [num.1.6: extract]
Processing 32/267: [dune.3.19.1, dune-configurator.3.19.1: extract] [num.1.6: extract] [ocaml_intrinsics_kernel.v0.18~preview.130.36+326: extract]
-> retrieved num.1.6  (cached)
Processing 32/267: [dune.3.19.1, dune-configurator.3.19.1: extract] [ocaml_intrinsics_kernel.v0.18~preview.130.36+326: extract]
Processing 33/267: [dune.3.19.1, dune-configurator.3.19.1: extract] [ocaml_intrinsics_kernel.v0.18~preview.130.36+326: extract] [parsexp.v0.18~preview.130.36+326: extract]
Processing 34/267: [dune.3.19.1, dune-configurator.3.19.1: extract] [ocaml_intrinsics_kernel.v0.18~preview.130.36+326: extract] [parsexp.v0.18~preview.130.36+326: extract] [num: make opam-modern]
-> retrieved ocaml_intrinsics_kernel.v0.18~preview.130.36+326  (cached)
Processing 34/267: [dune.3.19.1, dune-configurator.3.19.1: extract] [parsexp.v0.18~preview.130.36+326: extract] [num: make opam-modern]
Processing 35/267: [dune.3.19.1, dune-configurator.3.19.1: extract] [parsexp.v0.18~preview.130.36+326: extract] [portable.v0.18~preview.130.36+326: extract] [num: make opam-modern]
-> retrieved parsexp.v0.18~preview.130.36+326  (cached)
Processing 35/267: [dune.3.19.1, dune-configurator.3.19.1: extract] [portable.v0.18~preview.130.36+326: extract] [num: make opam-modern]
Processing 36/267: [dune.3.19.1, dune-configurator.3.19.1: extract] [portable.v0.18~preview.130.36+326: extract] [ppx_assert.v0.18~preview.130.36+326: extract] [num: make opam-modern]
-> retrieved portable.v0.18~preview.130.36+326  (cached)
Processing 36/267: [dune.3.19.1, dune-configurator.3.19.1: extract] [ppx_assert.v0.18~preview.130.36+326: extract] [num: make opam-modern]
Processing 37/267: [dune.3.19.1, dune-configurator.3.19.1: extract] [ppx_assert.v0.18~preview.130.36+326: extract] [ppx_base.v0.18~preview.130.36+326: extract] [num: make opam-modern]
-> retrieved ppx_assert.v0.18~preview.130.36+326  (cached)
Processing 37/267: [dune.3.19.1, dune-configurator.3.19.1: extract] [ppx_base.v0.18~preview.130.36+326: extract] [num: make opam-modern]
Processing 38/267: [dune.3.19.1, dune-configurator.3.19.1: extract] [ppx_base.v0.18~preview.130.36+326: extract] [ppx_bench.v0.18~preview.130.36+326: extract] [num: make opam-modern]
-> retrieved ppx_base.v0.18~preview.130.36+326  (cached)
Processing 38/267: [dune.3.19.1, dune-configurator.3.19.1: extract] [ppx_bench.v0.18~preview.130.36+326: extract] [num: make opam-modern]
Processing 39/267: [dune.3.19.1, dune-configurator.3.19.1: extract] [ppx_bench.v0.18~preview.130.36+326: extract] [ppx_bin_prot.v0.18~preview.130.36+326: extract] [num: make opam-modern]
-> retrieved ppx_bench.v0.18~preview.130.36+326  (cached)
Processing 39/267: [dune.3.19.1, dune-configurator.3.19.1: extract] [ppx_bin_prot.v0.18~preview.130.36+326: extract] [num: make opam-modern]
Processing 40/267: [dune.3.19.1, dune-configurator.3.19.1: extract] [ppx_bin_prot.v0.18~preview.130.36+326: extract] [ppx_cold.v0.18~preview.130.36+326: extract] [num: make opam-modern]
-> retrieved ppx_bin_prot.v0.18~preview.130.36+326  (cached)
Processing 40/267: [dune.3.19.1, dune-configurator.3.19.1: extract] [ppx_cold.v0.18~preview.130.36+326: extract] [num: make opam-modern]
Processing 41/267: [dune.3.19.1, dune-configurator.3.19.1: extract] [ppx_cold.v0.18~preview.130.36+326: extract] [ppx_compare.v0.18~preview.130.36+326: extract] [num: make opam-modern]
-> retrieved ppx_cold.v0.18~preview.130.36+326  (cached)
Processing 41/267: [dune.3.19.1, dune-configurator.3.19.1: extract] [ppx_compare.v0.18~preview.130.36+326: extract] [num: make opam-modern]
Processing 42/267: [dune.3.19.1, dune-configurator.3.19.1: extract] [ppx_compare.v0.18~preview.130.36+326: extract] [ppx_custom_printf.v0.18~preview.130.36+326: extract] [num: make opam-modern]
-> retrieved ppx_compare.v0.18~preview.130.36+326  (cached)
Processing 42/267: [dune.3.19.1, dune-configurator.3.19.1: extract] [ppx_custom_printf.v0.18~preview.130.36+326: extract] [num: make opam-modern]
Processing 43/267: [dune.3.19.1, dune-configurator.3.19.1: extract] [ppx_custom_printf.v0.18~preview.130.36+326: extract] [ppx_derivers.1.2.1: extract] [num: make opam-modern]
-> retrieved ppx_custom_printf.v0.18~preview.130.36+326  (cached)
Processing 43/267: [dune.3.19.1, dune-configurator.3.19.1: extract] [ppx_derivers.1.2.1: extract] [num: make opam-modern]
Processing 44/267: [dune.3.19.1, dune-configurator.3.19.1: extract] [ppx_derivers.1.2.1: extract] [ppx_diff.v0.18~preview.130.36+326: extract] [num: make opam-modern]
-> retrieved ppx_derivers.1.2.1  (cached)
Processing 44/267: [dune.3.19.1, dune-configurator.3.19.1: extract] [ppx_diff.v0.18~preview.130.36+326: extract] [num: make opam-modern]
Processing 45/267: [dune.3.19.1, dune-configurator.3.19.1: extract] [ppx_diff.v0.18~preview.130.36+326: extract] [ppx_disable_unused_warnings.v0.18~preview.130.36+326: extract] [num: make opam-modern]
-> retrieved ppx_disable_unused_warnings.v0.18~preview.130.36+326  (cached)
Processing 45/267: [dune.3.19.1, dune-configurator.3.19.1: extract] [ppx_diff.v0.18~preview.130.36+326: extract] [num: make opam-modern]
Processing 46/267: [dune.3.19.1, dune-configurator.3.19.1: extract] [ppx_diff.v0.18~preview.130.36+326: extract] [ppx_enumerate.v0.18~preview.130.36+326: extract] [num: make opam-modern]
-> retrieved ppx_diff.v0.18~preview.130.36+326  (cached)
Processing 46/267: [dune.3.19.1, dune-configurator.3.19.1: extract] [ppx_enumerate.v0.18~preview.130.36+326: extract] [num: make opam-modern]
Processing 47/267: [dune.3.19.1, dune-configurator.3.19.1: extract] [ppx_enumerate.v0.18~preview.130.36+326: extract] [ppx_expect.v0.18~preview.130.36+326: extract] [num: make opam-modern]
-> retrieved ppx_enumerate.v0.18~preview.130.36+326  (cached)
Processing 47/267: [dune.3.19.1, dune-configurator.3.19.1: extract] [ppx_expect.v0.18~preview.130.36+326: extract] [num: make opam-modern]
Processing 48/267: [dune.3.19.1, dune-configurator.3.19.1: extract] [ppx_expect.v0.18~preview.130.36+326: extract] [ppx_fields_conv.v0.18~preview.130.36+326: extract] [num: make opam-modern]
-> retrieved ppx_fields_conv.v0.18~preview.130.36+326  (cached)
Processing 48/267: [dune.3.19.1, dune-configurator.3.19.1: extract] [ppx_expect.v0.18~preview.130.36+326: extract] [num: make opam-modern]
Processing 49/267: [dune.3.19.1, dune-configurator.3.19.1: extract] [ppx_expect.v0.18~preview.130.36+326: extract] [ppx_fixed_literal.v0.18~preview.130.36+326: extract] [num: make opam-modern]
-> retrieved ppx_expect.v0.18~preview.130.36+326  (cached)
Processing 49/267: [dune.3.19.1, dune-configurator.3.19.1: extract] [ppx_fixed_literal.v0.18~preview.130.36+326: extract] [num: make opam-modern]
Processing 50/267: [dune.3.19.1, dune-configurator.3.19.1: extract] [ppx_fixed_literal.v0.18~preview.130.36+326: extract] [ppx_globalize.v0.18~preview.130.36+326: extract] [num: make opam-modern]
-> retrieved ppx_fixed_literal.v0.18~preview.130.36+326  (cached)
Processing 50/267: [dune.3.19.1, dune-configurator.3.19.1: extract] [ppx_globalize.v0.18~preview.130.36+326: extract] [num: make opam-modern]
Processing 51/267: [dune.3.19.1, dune-configurator.3.19.1: extract] [ppx_globalize.v0.18~preview.130.36+326: extract] [ppx_hash.v0.18~preview.130.36+326: extract] [num: make opam-modern]
-> retrieved ppx_globalize.v0.18~preview.130.36+326  (cached)
Processing 51/267: [dune.3.19.1, dune-configurator.3.19.1: extract] [ppx_hash.v0.18~preview.130.36+326: extract] [num: make opam-modern]
Processing 52/267: [dune.3.19.1, dune-configurator.3.19.1: extract] [ppx_hash.v0.18~preview.130.36+326: extract] [ppx_helpers.v0.18~preview.130.36+326: extract] [num: make opam-modern]
-> retrieved ppx_hash.v0.18~preview.130.36+326  (cached)
Processing 52/267: [dune.3.19.1, dune-configurator.3.19.1: extract] [ppx_helpers.v0.18~preview.130.36+326: extract] [num: make opam-modern]
Processing 53/267: [dune.3.19.1, dune-configurator.3.19.1: extract] [ppx_helpers.v0.18~preview.130.36+326: extract] [ppx_here.v0.18~preview.130.36+326: extract] [num: make opam-modern]
-> retrieved ppx_helpers.v0.18~preview.130.36+326  (cached)
Processing 53/267: [dune.3.19.1, dune-configurator.3.19.1: extract] [ppx_here.v0.18~preview.130.36+326: extract] [num: make opam-modern]
Processing 54/267: [dune.3.19.1, dune-configurator.3.19.1: extract] [ppx_here.v0.18~preview.130.36+326: extract] [ppx_ignore_instrumentation.v0.18~preview.130.36+326: extract] [num: make opam-modern]
-> retrieved ppx_here.v0.18~preview.130.36+326  (cached)
Processing 54/267: [dune.3.19.1, dune-configurator.3.19.1: extract] [ppx_ignore_instrumentation.v0.18~preview.130.36+326: extract] [num: make opam-modern]
Processing 55/267: [dune.3.19.1, dune-configurator.3.19.1: extract] [ppx_ignore_instrumentation.v0.18~preview.130.36+326: extract] [ppx_inline_test.v0.18~preview.130.36+326: extract] [num: make opam-modern]
-> retrieved ppx_ignore_instrumentation.v0.18~preview.130.36+326  (cached)
Processing 55/267: [dune.3.19.1, dune-configurator.3.19.1: extract] [ppx_inline_test.v0.18~preview.130.36+326: extract] [num: make opam-modern]
Processing 56/267: [dune.3.19.1, dune-configurator.3.19.1: extract] [ppx_inline_test.v0.18~preview.130.36+326: extract] [ppx_jane.v0.18~preview.130.36+326: extract] [num: make opam-modern]
-> retrieved ppx_inline_test.v0.18~preview.130.36+326  (cached)
Processing 56/267: [dune.3.19.1, dune-configurator.3.19.1: extract] [ppx_jane.v0.18~preview.130.36+326: extract] [num: make opam-modern]
Processing 57/267: [dune.3.19.1, dune-configurator.3.19.1: extract] [ppx_jane.v0.18~preview.130.36+326: extract] [ppx_let.v0.18~preview.130.36+326: extract] [num: make opam-modern]
-> retrieved dune.3.19.1, dune-configurator.3.19.1  (cached)
Processing 57/267: [ppx_jane.v0.18~preview.130.36+326: extract] [ppx_let.v0.18~preview.130.36+326: extract] [num: make opam-modern]
Processing 58/267: [ppx_jane.v0.18~preview.130.36+326: extract] [ppx_let.v0.18~preview.130.36+326: extract] [ppx_log.v0.18~preview.130.36+326: extract] [num: make opam-modern]
Processing 59/267: [ppx_jane.v0.18~preview.130.36+326: extract] [ppx_let.v0.18~preview.130.36+326: extract] [ppx_log.v0.18~preview.130.36+326: extract] [dune: ocaml 255] [num: make opam-modern]
+ /home/opam/.opam/opam-init/hooks/sandbox.sh "build" "make" "PROFILE=release" "opam-modern" (CWD=/home/opam/.opam/5.2.0+flambda2/.opam-switch/build/num.1.6)
- make -C src all
- make[1]: Entering directory '/home/opam/.opam/5.2.0+flambda2/.opam-switch/build/num.1.6/src'
- ocamlc -ccopt -DBNG_ARCH_amd64 -c bng.c
- ocamlc -ccopt -DBNG_ARCH_amd64 -c nat_stubs.c
- ocamlmklib -oc nums bng.o nat_stubs.o
- ocamlc -w +a-4-9-41-42-44-45-48  -bin-annot -g -safe-string -strict-sequence -strict-formats -I +compiler-libs -c int_misc.mli
- ocamlc -w +a-4-9-41-42-44-45-48  -bin-annot -g -safe-string -strict-sequence -strict-formats -I +compiler-libs -c int_misc.ml
- ocamlc -w +a-4-9-41-42-44-45-48  -bin-annot -g -safe-string -strict-sequence -strict-formats -I +compiler-libs -c nat.mli
- ocamlc -w +a-4-9-41-42-44-45-48  -bin-annot -g -safe-string -strict-sequence -strict-formats -I +compiler-libs -c nat.ml
- ocamlc -w +a-4-9-41-42-44-45-48  -bin-annot -g -safe-string -strict-sequence -strict-formats -I +compiler-libs -c big_int.mli
- ocamlc -w +a-4-9-41-42-44-45-48  -bin-annot -g -safe-string -strict-sequence -strict-formats -I +compiler-libs -c big_int.ml
- ocamlc -w +a-4-9-41-42-44-45-48  -bin-annot -g -safe-string -strict-sequence -strict-formats -I +compiler-libs -c arith_flags.mli
- ocamlc -w +a-4-9-41-42-44-45-48  -bin-annot -g -safe-string -strict-sequence -strict-formats -I +compiler-libs -c arith_flags.ml
- ocamlc -w +a-4-9-41-42-44-45-48  -bin-annot -g -safe-string -strict-sequence -strict-formats -I +compiler-libs -c ratio.mli
- ocamlc -w +a-4-9-41-42-44-45-48  -bin-annot -g -safe-string -strict-sequence -strict-formats -I +compiler-libs -c ratio.ml
- ocamlc -w +a-4-9-41-42-44-45-48  -bin-annot -g -safe-string -strict-sequence -strict-formats -I +compiler-libs -c num.mli
- ocamlc -w +a-4-9-41-42-44-45-48  -bin-annot -g -safe-string -strict-sequence -strict-formats -I +compiler-libs -c num.ml
- ocamlc -w +a-4-9-41-42-44-45-48  -bin-annot -g -safe-string -strict-sequence -strict-formats -I +compiler-libs -c arith_status.mli
- ocamlc -w +a-4-9-41-42-44-45-48  -bin-annot -g -safe-string -strict-sequence -strict-formats -I +compiler-libs -c arith_status.ml
- ocamlmklib -o nums -oc nums -linkall int_misc.cmo nat.cmo big_int.cmo arith_flags.cmo ratio.cmo num.cmo arith_status.cmo
- cp ../toplevel/num_top_printers.mli ../toplevel/num_top.mli ../toplevel/num_top_printers.ml ../toplevel/num_top.ml .
- ocamlc -w +a-4-9-41-42-44-45-48  -bin-annot -g -safe-string -strict-sequence -strict-formats -I +compiler-libs -c num_top_printers.mli
- ocamlc -w +a-4-9-41-42-44-45-48  -bin-annot -g -safe-string -strict-sequence -strict-formats -I +compiler-libs -c num_top_printers.ml
- ocamlc -w +a-4-9-41-42-44-45-48  -bin-annot -g -safe-string -strict-sequence -strict-formats -I +compiler-libs -c num_top.mli
- ocamlc -w +a-4-9-41-42-44-45-48  -bin-annot -g -safe-string -strict-sequence -strict-formats -I +compiler-libs -c num_top.ml
- ocamlc -w +a-4-9-41-42-44-45-48  -bin-annot -g -safe-string -strict-sequence -strict-formats -I +compiler-libs -a -o num_top.cma num_top_printers.cmo num_top.cmo
- echo 'version = "1.7~dev"' > META.top
- cat META.num-top.in >> META.top
- ocamlopt -w +a-4-9-41-42-44-45-48  -bin-annot -g -safe-string -strict-sequence -strict-formats -I +compiler-libs -c int_misc.ml
- ocamlopt -w +a-4-9-41-42-44-45-48  -bin-annot -g -safe-string -strict-sequence -strict-formats -I +compiler-libs -c nat.ml
- ocamlopt -w +a-4-9-41-42-44-45-48  -bin-annot -g -safe-string -strict-sequence -strict-formats -I +compiler-libs -c big_int.ml
- ocamlopt -w +a-4-9-41-42-44-45-48  -bin-annot -g -safe-string -strict-sequence -strict-formats -I +compiler-libs -c arith_flags.ml
- ocamlopt -w +a-4-9-41-42-44-45-48  -bin-annot -g -safe-string -strict-sequence -strict-formats -I +compiler-libs -c ratio.ml
- ocamlopt -w +a-4-9-41-42-44-45-48  -bin-annot -g -safe-string -strict-sequence -strict-formats -I +compiler-libs -c num.ml
- ocamlopt -w +a-4-9-41-42-44-45-48  -bin-annot -g -safe-string -strict-sequence -strict-formats -I +compiler-libs -c arith_status.ml
- ocamlmklib -o nums -oc nums -linkall int_misc.cmx nat.cmx big_int.cmx arith_flags.cmx ratio.cmx num.cmx arith_status.cmx
- ocamlopt -w +a-4-9-41-42-44-45-48  -bin-annot -g -safe-string -strict-sequence -strict-formats -I +compiler-libs -I . -shared -o nums.cmxs nums.cmxa
- make[1]: Leaving directory '/home/opam/.opam/5.2.0+flambda2/.opam-switch/build/num.1.6/src'
- cp src/num-modern.install num.install
-> compiled  num.1.6
Processing 59/267: [ppx_jane.v0.18~preview.130.36+326: extract] [ppx_let.v0.18~preview.130.36+326: extract] [ppx_log.v0.18~preview.130.36+326: extract] [dune: ocaml 255]
-> installed num.1.6
Processing 60/267: [ppx_jane.v0.18~preview.130.36+326: extract] [ppx_let.v0.18~preview.130.36+326: extract] [ppx_log.v0.18~preview.130.36+326: extract] [dune: ocaml 255]
-> retrieved ppx_jane.v0.18~preview.130.36+326  (cached)
Processing 60/267: [ppx_let.v0.18~preview.130.36+326: extract] [ppx_log.v0.18~preview.130.36+326: extract] [dune: ocaml 255]
Processing 61/267: [ppx_let.v0.18~preview.130.36+326: extract] [ppx_log.v0.18~preview.130.36+326: extract] [ppx_module_timer.v0.18~preview.130.36+326: extract] [dune: ocaml 255]
-> retrieved ppx_let.v0.18~preview.130.36+326  (cached)
Processing 61/267: [ppx_log.v0.18~preview.130.36+326: extract] [ppx_module_timer.v0.18~preview.130.36+326: extract] [dune: ocaml 255]
Processing 62/267: [ppx_log.v0.18~preview.130.36+326: extract] [ppx_module_timer.v0.18~preview.130.36+326: extract] [ppx_optcomp.v0.18~preview.130.36+326: extract] [dune: ocaml 255]
-> retrieved ppx_log.v0.18~preview.130.36+326  (cached)
Processing 62/267: [ppx_module_timer.v0.18~preview.130.36+326: extract] [ppx_optcomp.v0.18~preview.130.36+326: extract] [dune: ocaml 255]
Processing 63/267: [ppx_module_timer.v0.18~preview.130.36+326: extract] [ppx_optcomp.v0.18~preview.130.36+326: extract] [ppx_optional.v0.18~preview.130.36+326: extract] [dune: ocaml 255]
-> retrieved ppx_module_timer.v0.18~preview.130.36+326  (cached)
Processing 63/267: [ppx_optcomp.v0.18~preview.130.36+326: extract] [ppx_optional.v0.18~preview.130.36+326: extract] [dune: ocaml 255]
Processing 64/267: [ppx_optcomp.v0.18~preview.130.36+326: extract] [ppx_optional.v0.18~preview.130.36+326: extract] [ppx_pipebang.v0.18~preview.130.36+326: extract] [dune: ocaml 255]
-> retrieved ppx_optcomp.v0.18~preview.130.36+326  (cached)
Processing 64/267: [ppx_optional.v0.18~preview.130.36+326: extract] [ppx_pipebang.v0.18~preview.130.36+326: extract] [dune: ocaml 255]
Processing 65/267: [ppx_optional.v0.18~preview.130.36+326: extract] [ppx_pipebang.v0.18~preview.130.36+326: extract] [ppx_sexp_conv.v0.18~preview.130.36+326: extract] [dune: ocaml 255]
-> retrieved ppx_optional.v0.18~preview.130.36+326  (cached)
Processing 65/267: [ppx_pipebang.v0.18~preview.130.36+326: extract] [ppx_sexp_conv.v0.18~preview.130.36+326: extract] [dune: ocaml 255]
Processing 66/267: [ppx_pipebang.v0.18~preview.130.36+326: extract] [ppx_sexp_conv.v0.18~preview.130.36+326: extract] [ppx_sexp_message.v0.18~preview.130.36+326: extract] [dune: ocaml 255]
-> retrieved ppx_pipebang.v0.18~preview.130.36+326  (cached)
Processing 66/267: [ppx_sexp_conv.v0.18~preview.130.36+326: extract] [ppx_sexp_message.v0.18~preview.130.36+326: extract] [dune: ocaml 255]
Processing 67/267: [ppx_sexp_conv.v0.18~preview.130.36+326: extract] [ppx_sexp_message.v0.18~preview.130.36+326: extract] [ppx_sexp_value.v0.18~preview.130.36+326: extract] [dune: ocaml 255]
-> retrieved ppx_sexp_message.v0.18~preview.130.36+326  (cached)
Processing 67/267: [ppx_sexp_conv.v0.18~preview.130.36+326: extract] [ppx_sexp_value.v0.18~preview.130.36+326: extract] [dune: ocaml 255]
Processing 68/267: [ppx_sexp_conv.v0.18~preview.130.36+326: extract] [ppx_sexp_value.v0.18~preview.130.36+326: extract] [ppx_shorthand.v0.18~preview.130.36+326: extract] [dune: ocaml 255]
-> retrieved ppx_sexp_conv.v0.18~preview.130.36+326  (cached)
Processing 68/267: [ppx_sexp_value.v0.18~preview.130.36+326: extract] [ppx_shorthand.v0.18~preview.130.36+326: extract] [dune: ocaml 255]
Processing 69/267: [ppx_sexp_value.v0.18~preview.130.36+326: extract] [ppx_shorthand.v0.18~preview.130.36+326: extract] [ppx_stable.v0.18~preview.130.36+326: extract] [dune: ocaml 255]
-> retrieved ppx_sexp_value.v0.18~preview.130.36+326  (cached)
Processing 69/267: [ppx_shorthand.v0.18~preview.130.36+326: extract] [ppx_stable.v0.18~preview.130.36+326: extract] [dune: ocaml 255]
Processing 70/267: [ppx_shorthand.v0.18~preview.130.36+326: extract] [ppx_stable.v0.18~preview.130.36+326: extract] [ppx_stable_witness.v0.18~preview.130.36+326: extract] [dune: ocaml 255]
-> retrieved ppx_shorthand.v0.18~preview.130.36+326  (cached)
Processing 70/267: [ppx_stable.v0.18~preview.130.36+326: extract] [ppx_stable_witness.v0.18~preview.130.36+326: extract] [dune: ocaml 255]
Processing 71/267: [ppx_stable.v0.18~preview.130.36+326: extract] [ppx_stable_witness.v0.18~preview.130.36+326: extract] [ppx_string.v0.18~preview.130.36+326: extract] [dune: ocaml 255]
-> retrieved ppx_stable.v0.18~preview.130.36+326  (cached)
Processing 71/267: [ppx_stable_witness.v0.18~preview.130.36+326: extract] [ppx_string.v0.18~preview.130.36+326: extract] [dune: ocaml 255]
Processing 72/267: [ppx_stable_witness.v0.18~preview.130.36+326: extract] [ppx_string.v0.18~preview.130.36+326: extract] [ppx_string_conv.v0.18~preview.130.36+326: extract] [dune: ocaml 255]
-> retrieved ppx_stable_witness.v0.18~preview.130.36+326  (cached)
Processing 72/267: [ppx_string.v0.18~preview.130.36+326: extract] [ppx_string_conv.v0.18~preview.130.36+326: extract] [dune: ocaml 255]
Processing 73/267: [ppx_string.v0.18~preview.130.36+326: extract] [ppx_string_conv.v0.18~preview.130.36+326: extract] [ppx_template.v0.18~preview.130.36+326: extract] [dune: ocaml 255]
-> retrieved ppx_string.v0.18~preview.130.36+326  (cached)
Processing 73/267: [ppx_string_conv.v0.18~preview.130.36+326: extract] [ppx_template.v0.18~preview.130.36+326: extract] [dune: ocaml 255]
Processing 74/267: [ppx_string_conv.v0.18~preview.130.36+326: extract] [ppx_template.v0.18~preview.130.36+326: extract] [ppx_tydi.v0.18~preview.130.36+326: extract] [dune: ocaml 255]
-> retrieved ppx_string_conv.v0.18~preview.130.36+326  (cached)
Processing 74/267: [ppx_template.v0.18~preview.130.36+326: extract] [ppx_tydi.v0.18~preview.130.36+326: extract] [dune: ocaml 255]
Processing 75/267: [ppx_template.v0.18~preview.130.36+326: extract] [ppx_tydi.v0.18~preview.130.36+326: extract] [ppx_typed_fields.v0.18~preview.130.36+326: extract] [dune: ocaml 255]
-> retrieved ppx_template.v0.18~preview.130.36+326  (cached)
Processing 75/267: [ppx_tydi.v0.18~preview.130.36+326: extract] [ppx_typed_fields.v0.18~preview.130.36+326: extract] [dune: ocaml 255]
Processing 76/267: [ppx_tydi.v0.18~preview.130.36+326: extract] [ppx_typed_fields.v0.18~preview.130.36+326: extract] [ppx_typerep_conv.v0.18~preview.130.36+326: extract] [dune: ocaml 255]
-> retrieved ppx_tydi.v0.18~preview.130.36+326  (cached)
Processing 76/267: [ppx_typed_fields.v0.18~preview.130.36+326: extract] [ppx_typerep_conv.v0.18~preview.130.36+326: extract] [dune: ocaml 255]
Processing 77/267: [ppx_typed_fields.v0.18~preview.130.36+326: extract] [ppx_typerep_conv.v0.18~preview.130.36+326: extract] [ppx_var_name.v0.18~preview.130.36+326: extract] [dune: ocaml 255]
-> retrieved ppx_typed_fields.v0.18~preview.130.36+326  (cached)
Processing 77/267: [ppx_typerep_conv.v0.18~preview.130.36+326: extract] [ppx_var_name.v0.18~preview.130.36+326: extract] [dune: ocaml 255]
Processing 78/267: [ppx_typerep_conv.v0.18~preview.130.36+326: extract] [ppx_var_name.v0.18~preview.130.36+326: extract] [ppx_variants_conv.v0.18~preview.130.36+326: extract] [dune: ocaml 255]
-> retrieved ppx_typerep_conv.v0.18~preview.130.36+326  (cached)
Processing 78/267: [ppx_var_name.v0.18~preview.130.36+326: extract] [ppx_variants_conv.v0.18~preview.130.36+326: extract] [dune: ocaml 255]
Processing 79/267: [ppx_var_name.v0.18~preview.130.36+326: extract] [ppx_variants_conv.v0.18~preview.130.36+326: extract] [ppxlib.0.33.0+ox, ppxlib_ast.0.33.0+ox: extract] [dune: ocaml 255]
-> retrieved ppx_var_name.v0.18~preview.130.36+326  (cached)
Processing 79/267: [ppx_variants_conv.v0.18~preview.130.36+326: extract] [ppxlib.0.33.0+ox, ppxlib_ast.0.33.0+ox: extract] [dune: ocaml 255]
Processing 80/267: [ppx_variants_conv.v0.18~preview.130.36+326: extract] [ppxlib.0.33.0+ox, ppxlib_ast.0.33.0+ox: extract] [ppxlib_jane.v0.18~preview.130.36+326: extract] [dune: ocaml 255]
-> retrieved ppx_variants_conv.v0.18~preview.130.36+326  (cached)
Processing 80/267: [ppxlib.0.33.0+ox, ppxlib_ast.0.33.0+ox: extract] [ppxlib_jane.v0.18~preview.130.36+326: extract] [dune: ocaml 255]
Processing 81/267: [ppxlib.0.33.0+ox, ppxlib_ast.0.33.0+ox: extract] [ppxlib_jane.v0.18~preview.130.36+326: extract] [re.1.13.2: extract] [dune: ocaml 255]
-> retrieved ppxlib_jane.v0.18~preview.130.36+326  (cached)
Processing 81/267: [ppxlib.0.33.0+ox, ppxlib_ast.0.33.0+ox: extract] [re.1.13.2: extract] [dune: ocaml 255]
-> retrieved seq.base  (cached)
Processing 82/267: [ppxlib.0.33.0+ox, ppxlib_ast.0.33.0+ox: extract] [re.1.13.2: extract] [dune: ocaml 255]
Processing 83/267: [ppxlib.0.33.0+ox, ppxlib_ast.0.33.0+ox: extract] [re.1.13.2: extract] [sexp_pretty.v0.18~preview.130.36+326: extract] [dune: ocaml 255]
Processing 84/267: [ppxlib.0.33.0+ox, ppxlib_ast.0.33.0+ox: extract] [re.1.13.2: extract] [sexp_pretty.v0.18~preview.130.36+326: extract] [dune: ocaml 255]
-> installed seq.base
Processing 85/267: [ppxlib.0.33.0+ox, ppxlib_ast.0.33.0+ox: extract] [re.1.13.2: extract] [sexp_pretty.v0.18~preview.130.36+326: extract] [dune: ocaml 255]
-> retrieved ppxlib.0.33.0+ox, ppxlib_ast.0.33.0+ox  (cached)
Processing 85/267: [re.1.13.2: extract] [sexp_pretty.v0.18~preview.130.36+326: extract] [dune: ocaml 255]
Processing 86/267: [re.1.13.2: extract] [sexp_pretty.v0.18~preview.130.36+326: extract] [sexplib.v0.18~preview.130.36+326: extract] [dune: ocaml 255]
-> retrieved re.1.13.2  (cached)
Processing 86/267: [sexp_pretty.v0.18~preview.130.36+326: extract] [sexplib.v0.18~preview.130.36+326: extract] [dune: ocaml 255]
Processing 87/267: [sexp_pretty.v0.18~preview.130.36+326: extract] [sexplib.v0.18~preview.130.36+326: extract] [sexplib0.v0.18~preview.130.36+326: extract] [dune: ocaml 255]
-> retrieved sexp_pretty.v0.18~preview.130.36+326  (cached)
Processing 87/267: [sexplib.v0.18~preview.130.36+326: extract] [sexplib0.v0.18~preview.130.36+326: extract] [dune: ocaml 255]
Processing 88/267: [sexplib.v0.18~preview.130.36+326: extract] [sexplib0.v0.18~preview.130.36+326: extract] [spawn.v0.17.0: extract] [dune: ocaml 255]
-> retrieved sexplib.v0.18~preview.130.36+326  (cached)
Processing 88/267: [sexplib0.v0.18~preview.130.36+326: extract] [spawn.v0.17.0: extract] [dune: ocaml 255]
Processing 89/267: [sexplib0.v0.18~preview.130.36+326: extract] [spawn.v0.17.0: extract] [splittable_random.v0.18~preview.130.36+326: extract] [dune: ocaml 255]
-> retrieved sexplib0.v0.18~preview.130.36+326  (cached)
Processing 89/267: [spawn.v0.17.0: extract] [splittable_random.v0.18~preview.130.36+326: extract] [dune: ocaml 255]
Processing 90/267: [spawn.v0.17.0: extract] [splittable_random.v0.18~preview.130.36+326: extract] [stdio.v0.18~preview.130.36+326: extract] [dune: ocaml 255]
-> retrieved spawn.v0.17.0  (cached)
Processing 90/267: [splittable_random.v0.18~preview.130.36+326: extract] [stdio.v0.18~preview.130.36+326: extract] [dune: ocaml 255]
Processing 91/267: [splittable_random.v0.18~preview.130.36+326: extract] [stdio.v0.18~preview.130.36+326: extract] [stdlib-shims.0.3.0: extract] [dune: ocaml 255]
-> retrieved splittable_random.v0.18~preview.130.36+326  (cached)
Processing 91/267: [stdio.v0.18~preview.130.36+326: extract] [stdlib-shims.0.3.0: extract] [dune: ocaml 255]
Processing 92/267: [stdio.v0.18~preview.130.36+326: extract] [stdlib-shims.0.3.0: extract] [string_dict.v0.18~preview.130.36+326: extract] [dune: ocaml 255]
-> retrieved stdio.v0.18~preview.130.36+326  (cached)
Processing 92/267: [stdlib-shims.0.3.0: extract] [string_dict.v0.18~preview.130.36+326: extract] [dune: ocaml 255]
Processing 93/267: [stdlib-shims.0.3.0: extract] [string_dict.v0.18~preview.130.36+326: extract] [time_now.v0.18~preview.130.36+326: extract] [dune: ocaml 255]
-> retrieved stdlib-shims.0.3.0  (cached)
Processing 93/267: [string_dict.v0.18~preview.130.36+326: extract] [time_now.v0.18~preview.130.36+326: extract] [dune: ocaml 255]
Processing 94/267: [string_dict.v0.18~preview.130.36+326: extract] [time_now.v0.18~preview.130.36+326: extract] [torch.v0.18~preview.130.36+326: http] [dune: ocaml 255]
-> retrieved string_dict.v0.18~preview.130.36+326  (cached)
Processing 94/267: [time_now.v0.18~preview.130.36+326: extract] [torch.v0.18~preview.130.36+326: http] [dune: ocaml 255]
Processing 95/267: [time_now.v0.18~preview.130.36+326: extract] [torch.v0.18~preview.130.36+326: http] [typerep.v0.18~preview.130.36+326: extract] [dune: ocaml 255]
-> retrieved time_now.v0.18~preview.130.36+326  (cached)
Processing 95/267: [torch.v0.18~preview.130.36+326: http] [typerep.v0.18~preview.130.36+326: extract] [dune: ocaml 255]
Processing 96/267: [torch.v0.18~preview.130.36+326: http] [typerep.v0.18~preview.130.36+326: extract] [univ_map.v0.18~preview.130.36+326: extract] [dune: ocaml 255]
-> retrieved typerep.v0.18~preview.130.36+326  (cached)
Processing 96/267: [torch.v0.18~preview.130.36+326: http] [univ_map.v0.18~preview.130.36+326: extract] [dune: ocaml 255]
Processing 97/267: [torch.v0.18~preview.130.36+326: http] [univ_map.v0.18~preview.130.36+326: extract] [uopt.v0.18~preview.130.36+326: extract] [dune: ocaml 255]
-> retrieved univ_map.v0.18~preview.130.36+326  (cached)
Processing 97/267: [torch.v0.18~preview.130.36+326: http] [uopt.v0.18~preview.130.36+326: extract] [dune: ocaml 255]
Processing 98/267: [torch.v0.18~preview.130.36+326: http] [uopt.v0.18~preview.130.36+326: extract] [variantslib.v0.18~preview.130.36+326: extract] [dune: ocaml 255]
-> retrieved uopt.v0.18~preview.130.36+326  (cached)
Processing 98/267: [torch.v0.18~preview.130.36+326: http] [variantslib.v0.18~preview.130.36+326: extract] [dune: ocaml 255]
-> retrieved variantslib.v0.18~preview.130.36+326  (cached)
Processing 98/267: [torch.v0.18~preview.130.36+326: http] [dune: ocaml 255]
Processing 98/267: [torch.v0.18~preview.130.36+326: extract] [dune: ocaml 255]
-> retrieved torch.v0.18~preview.130.36+326  (https://github.com/janestreet/torch/archive/c6332ab23181eb0cf0c4979395c51cfff4f3257a.tar.gz)
Processing 98/267: [dune: ocaml 255]
+ /home/opam/.opam/opam-init/hooks/sandbox.sh "build" "ocaml" "boot/bootstrap.ml" "-j" "255" (CWD=/home/opam/.opam/5.2.0+flambda2/.opam-switch/build/dune.3.19.1)
- ocamlc -output-complete-exe -w -24 -g -o .duneboot.exe -I boot -I +unix unix.cma boot/libs.ml boot/duneboot.ml
- ./.duneboot.exe -j 255
- cd _boot && /home/opam/.opam/5.2.0+flambda2/bin/ocamlopt.opt -c -g -no-alias-deps -w -49-6 -alert -unstable -I +unix -I +threads ocamlc_loc.mli
- File "otherlibs/ocamlc-loc/src/ocamlc_loc.mli", line 1, characters 4-9:
- Warning 53 [misplaced-attribute]: the "alert" attribute cannot appear in this context
- cd _boot && /home/opam/.opam/5.2.0+flambda2/bin/ocamlopt.opt -c -g -no-alias-deps -w -49-6 -alert -unstable -I +unix -I +threads stdune__Code_error.ml
- File "otherlibs/stdune/src/code_error.ml", line 29, characters 2-27:
- Alert unsafe_multidomain: Stdlib.Printexc.register_printer
- Use [Printexc.Safe.register_printer].
- cd _boot && /home/opam/.opam/5.2.0+flambda2/bin/ocamlopt.opt -c -g -no-alias-deps -w -49-6 -alert -unstable -I +unix -I +threads notty_unix.ml
- File "vendor/notty/src-unix/notty_unix.ml", line 38, characters 23-29:
- Alert unsafe_multidomain: Stdlib.Sys.signal
- Use [Sys.Safe.signal].
- 
- File "vendor/notty/src-unix/notty_unix.ml", line 39, characters 31-45:
- Alert unsafe_multidomain: Stdlib.Sys.set_signal
- Use [Sys.Safe.set_signal].
- cd _boot && /home/opam/.opam/5.2.0+flambda2/bin/ocamlopt.opt -c -g -no-alias-deps -w -49-6 -alert -unstable -I +unix -I +threads stdune__User_error.ml
- File "otherlibs/stdune/src/user_error.ml", line 17, characters 2-27:
- Alert unsafe_multidomain: Stdlib.Printexc.register_printer
- Use [Printexc.Safe.register_printer].
- cd _boot && /home/opam/.opam/5.2.0+flambda2/bin/ocamlopt.opt -c -g -no-alias-deps -w -49-6 -alert -unstable -I +unix -I +threads opamStd.ml
- File "vendor/opam/src/core/opamStd.ml", line 960, characters 10-24:
- Alert unsafe_multidomain: Stdlib.Sys.set_signal
- Use [Sys.Safe.set_signal].
- cd _boot && /home/opam/.opam/5.2.0+flambda2/bin/ocamlopt.opt -c -g -no-alias-deps -w -49-6 -alert -unstable -I +unix -I +threads dune_rpc_private__Conv.ml
- File "otherlibs/dune-rpc/private/conv.ml", line 48, characters 2-27:
- Alert unsafe_multidomain: Stdlib.Printexc.register_printer
- Use [Printexc.Safe.register_printer].
- cd _boot && /home/opam/.opam/5.2.0+flambda2/bin/ocamlopt.opt -c -g -no-alias-deps -w -49-6 -alert -unstable -I +unix -I +threads dune_rpc_private__Where.ml
- File "otherlibs/dune-rpc/private/where.ml", line 22, characters 2-27:
- Alert unsafe_multidomain: Stdlib.Printexc.register_printer
- Use [Printexc.Safe.register_printer].
- cd _boot && /home/opam/.opam/5.2.0+flambda2/bin/ocamlopt.opt -c -g -no-alias-deps -w -49-6 -alert -unstable -I +unix -I +threads dune_rpc_private__Types.ml
- File "otherlibs/dune-rpc/private/types.ml", line 154, characters 6-31:
- Alert unsafe_multidomain: Stdlib.Printexc.register_printer
- Use [Printexc.Safe.register_printer].
- cd _boot && /home/opam/.opam/5.2.0+flambda2/bin/ocamlopt.opt -c -g -no-alias-deps -w -49-6 -alert -unstable -I +unix -I +threads dune_rpc_private__Registry.ml
- File "otherlibs/dune-rpc/private/registry.ml", line 67, characters 4-29:
- Alert unsafe_multidomain: Stdlib.Printexc.register_printer
- Use [Printexc.Safe.register_printer].
- cd _boot && /home/opam/.opam/5.2.0+flambda2/bin/ocamlopt.opt -c -g -no-alias-deps -w -49-6 -alert -unstable -I +unix -I +threads opamSystem.ml
- File "vendor/opam/src/core/opamSystem.ml", line 1248, characters 2-27:
- Alert unsafe_multidomain: Stdlib.Printexc.register_printer
- Use [Printexc.Safe.register_printer].
- 
- File "vendor/opam/src/core/opamSystem.ml", line 1264, characters 6-20:
- Alert unsafe_multidomain: Stdlib.Sys.set_signal
- Use [Sys.Safe.set_signal].
- cd _boot && /home/opam/.opam/5.2.0+flambda2/bin/ocamlopt.opt -c -g -no-alias-deps -w -49-6 -alert -unstable -I +unix -I +threads dune_rpc_private__Versioned.ml
- File "otherlibs/dune-rpc/private/versioned.ml", line 23, characters 4-29:
- Alert unsafe_multidomain: Stdlib.Printexc.register_printer
- Use [Printexc.Safe.register_printer].
- cd _boot && /home/opam/.opam/5.2.0+flambda2/bin/ocamlopt.opt -c -g -no-alias-deps -w -49-6 -alert -unstable -I +unix -I +threads memo.ml
- File "src/memo/memo.ml", line 414, characters 2-27:
- Alert unsafe_multidomain: Stdlib.Printexc.register_printer
- Use [Printexc.Safe.register_printer].
- cd _boot && /home/opam/.opam/5.2.0+flambda2/bin/ocamlopt.opt -c -g -no-alias-deps -w -49-6 -alert -unstable -I +unix -I +threads dune_rpc_private.ml
- File "otherlibs/dune-rpc/private/dune_rpc_private.ml", line 200, characters 6-31:
- Alert unsafe_multidomain: Stdlib.Printexc.register_printer
- Use [Printexc.Safe.register_printer].
- cd _boot && /home/opam/.opam/5.2.0+flambda2/bin/ocamlopt.opt -c -g -no-alias-deps -w -49-6 -alert -unstable -I +unix -I +threads dune_action_plugin.mli
- File "otherlibs/dune-action-plugin/src/dune_action_plugin.mli", line 1, characters 4-9:
- Warning 53 [misplaced-attribute]: the "alert" attribute cannot appear in this context
- cd _boot && /home/opam/.opam/5.2.0+flambda2/bin/ocamlopt.opt -c -g -no-alias-deps -w -49-6 -alert -unstable -I +unix -I +threads dune_rpc_server.ml
- File "src/dune_rpc_server/dune_rpc_server.ml", line 15, characters 2-27:
- Alert unsafe_multidomain: Stdlib.Printexc.register_printer
- Use [Printexc.Safe.register_printer].
- cd _boot && /home/opam/.opam/5.2.0+flambda2/bin/ocamlopt.opt -c -g -no-alias-deps -w -49-6 -alert -unstable -I +unix -I +threads dune_engine__Scheduler.ml
- File "src/dune_engine/scheduler.ml", line 54, characters 4-29:
- Alert unsafe_multidomain: Stdlib.Printexc.register_printer
- Use [Printexc.Safe.register_printer].
- 
- File "src/dune_engine/scheduler.ml", line 632, characters 6-20:
- Alert unsafe_multidomain: Dune_engine__.Import.Sys.set_signal
- Use [Sys.Safe.set_signal].
- cd _boot && /home/opam/.opam/5.2.0+flambda2/bin/ocamlopt.opt -c -g -no-alias-deps -w -49-6 -alert -unstable -I +unix -I +threads opamPp.ml
- File "vendor/opam/src/format/opamPp.ml", line 64, characters 9-34:
- Alert unsafe_multidomain: Stdlib.Printexc.register_printer
- Use [Printexc.Safe.register_printer].
- cd _boot && /home/opam/.opam/5.2.0+flambda2/bin/ocamlopt.opt -c -g -no-alias-deps -w -49-6 -alert -unstable -I +unix -I +threads dune_tui.ml
- File "src/dune_tui/dune_tui.ml", line 14, characters 7-21:
- Alert unsafe_multidomain: Dune_tui__.Import.Sys.set_signal
- Use [Sys.Safe.set_signal].
- 
- File "src/dune_tui/dune_tui.ml", line 22, characters 12-22:
- Alert unsafe_multidomain: Dune_tui__.Import.Sys.signal
- Use [Sys.Safe.signal].
- 

Processing 98/267: [dune: ./_boot/dune.exe build]
+ /home/opam/.opam/opam-init/hooks/sandbox.sh "build" "./_boot/dune.exe" "build" "dune.install" "--release" "--profile" "dune-bootstrap" "-j" "255" (CWD=/home/opam/.opam/5.2.0+flambda2/.opam-switch/build/dune.3.19.1)
-> compiled  dune.3.19.1
-> installed dune.3.19.1
[backoff: patch] applying backoff.patch
Processing 100/267: [backoff: dune build]
Processing 101/267: [backoff: dune build] [basement: dune build]
Processing 102/267: [backoff: dune build] [basement: dune build] [bigarray-compat: dune build]
Processing 103/267: [backoff: dune build] [basement: dune build] [bigarray-compat: dune build] [csexp: dune build]
Processing 104/267: [backoff: dune build] [basement: dune build] [bigarray-compat: dune build] [csexp: dune build] [jane-street-headers: dune build]
[ocaml-compiler-libs: patch] applying read_cma.patch
Processing 105/267: [backoff: dune build] [basement: dune build] [bigarray-compat: dune build] [csexp: dune build] [jane-street-headers: dune build] [ocaml-compiler-libs: dune build]
Processing 106/267: [backoff: dune build] [basement: dune build] [bigarray-compat: dune build] [csexp: dune build] [jane-street-headers: dune build] [ocaml-compiler-libs: dune build] [ocaml_intrinsics_kernel: dune build]
Processing 107/267: [backoff: dune build] [basement: dune build] [bigarray-compat: dune build] [csexp: dune build] [jane-street-headers: dune build] [ocaml-compiler-libs: dune build] [ocaml_intrinsics_kernel: dune build] [ppx_derivers: dune build]
Processing 108/267: [backoff: dune build] [basement: dune build] [bigarray-compat: dune build] [csexp: dune build] [jane-street-headers: dune build] [ocaml-compiler-libs: dune build] [ocaml_intrinsics_kernel: dune build] [ppx_derivers: dune build] [re: dune build]
Processing 109/267: [backoff: dune build] [basement: dune build] [bigarray-compat: dune build] [csexp: dune build] [jane-street-headers: dune build] [ocaml-compiler-libs: dune build] [ocaml_intrinsics_kernel: dune build] [ppx_derivers: dune build] [re: dune build] [spawn: dune build]
Processing 110/267: [backoff: dune build] [basement: dune build] [bigarray-compat: dune build] [csexp: dune build] [jane-street-headers: dune build] [ocaml-compiler-libs: dune build] [ocaml_intrinsics_kernel: dune build] [ppx_derivers: dune build] [re: dune build] [spawn: dune build] [stdlib-shims: dune build]
+ /home/opam/.opam/opam-init/hooks/sandbox.sh "build" "dune" "build" "-p" "jane-street-headers" "-j" "255" (CWD=/home/opam/.opam/5.2.0+flambda2/.opam-switch/build/jane-street-headers.v0.18~preview.130.36+326)
-> compiled  jane-street-headers.v0.18~preview.130.36+326
Processing 110/267: [backoff: dune build] [basement: dune build] [bigarray-compat: dune build] [csexp: dune build] [ocaml-compiler-libs: dune build] [ocaml_intrinsics_kernel: dune build] [ppx_derivers: dune build] [re: dune build] [spawn: dune build] [stdlib-shims: dune build]
-> installed jane-street-headers.v0.18~preview.130.36+326
Processing 111/267: [backoff: dune build] [basement: dune build] [bigarray-compat: dune build] [csexp: dune build] [ocaml-compiler-libs: dune build] [ocaml_intrinsics_kernel: dune build] [ppx_derivers: dune build] [re: dune build] [spawn: dune build] [stdlib-shims: dune build]
+ /home/opam/.opam/opam-init/hooks/sandbox.sh "build" "dune" "build" "-p" "ppx_derivers" "-j" "255" (CWD=/home/opam/.opam/5.2.0+flambda2/.opam-switch/build/ppx_derivers.1.2.1)
-> compiled  ppx_derivers.1.2.1
Processing 111/267: [backoff: dune build] [basement: dune build] [bigarray-compat: dune build] [csexp: dune build] [ocaml-compiler-libs: dune build] [ocaml_intrinsics_kernel: dune build] [re: dune build] [spawn: dune build] [stdlib-shims: dune build]
-> installed ppx_derivers.1.2.1
Processing 112/267: [backoff: dune build] [basement: dune build] [bigarray-compat: dune build] [csexp: dune build] [ocaml-compiler-libs: dune build] [ocaml_intrinsics_kernel: dune build] [re: dune build] [spawn: dune build] [stdlib-shims: dune build]
+ /home/opam/.opam/opam-init/hooks/sandbox.sh "build" "dune" "build" "-p" "backoff" "-j" "255" "@install" (CWD=/home/opam/.opam/5.2.0+flambda2/.opam-switch/build/backoff.0.1.1+ox)
-> compiled  backoff.0.1.1+ox
Processing 112/267: [basement: dune build] [bigarray-compat: dune build] [csexp: dune build] [ocaml-compiler-libs: dune build] [ocaml_intrinsics_kernel: dune build] [re: dune build] [spawn: dune build] [stdlib-shims: dune build]
-> installed backoff.0.1.1+ox
Processing 113/267: [basement: dune build] [bigarray-compat: dune build] [csexp: dune build] [ocaml-compiler-libs: dune build] [ocaml_intrinsics_kernel: dune build] [re: dune build] [spawn: dune build] [stdlib-shims: dune build]
+ /home/opam/.opam/opam-init/hooks/sandbox.sh "build" "dune" "build" "-p" "spawn" "-j" "255" "@install" (CWD=/home/opam/.opam/5.2.0+flambda2/.opam-switch/build/spawn.v0.17.0)
-> compiled  spawn.v0.17.0
Processing 113/267: [basement: dune build] [bigarray-compat: dune build] [csexp: dune build] [ocaml-compiler-libs: dune build] [ocaml_intrinsics_kernel: dune build] [re: dune build] [stdlib-shims: dune build]
-> installed spawn.v0.17.0
Processing 114/267: [basement: dune build] [bigarray-compat: dune build] [csexp: dune build] [ocaml-compiler-libs: dune build] [ocaml_intrinsics_kernel: dune build] [re: dune build] [stdlib-shims: dune build]
+ /home/opam/.opam/opam-init/hooks/sandbox.sh "build" "dune" "build" "-p" "csexp" "-j" "255" "@install" (CWD=/home/opam/.opam/5.2.0+flambda2/.opam-switch/build/csexp.1.5.2)
- (cd _build/default && /home/opam/.opam/5.2.0+flambda2/bin/ocamlc.opt -w -40 -g -bin-annot -bin-annot-occurrences -I src/.csexp.objs/byte -intf-suffix .ml -no-alias-deps -o src/.csexp.objs/byte/csexp.cmo -c -impl src/csexp.ml)
- File "src/csexp.ml", line 236, characters 7-14:
- 236 |     [@@inlined always]
-              ^^^^^^^
- Warning 53 [misplaced-attribute]: the "inlined" attribute cannot appear in this context
- (cd _build/default && /home/opam/.opam/5.2.0+flambda2/bin/ocamlopt.opt -w -40 -g -I src/.csexp.objs/byte -I src/.csexp.objs/native -intf-suffix .ml -no-alias-deps -o src/.csexp.objs/native/csexp.cmx -c -impl src/csexp.ml)
- File "src/csexp.ml", line 236, characters 7-14:
- 236 |     [@@inlined always]
-              ^^^^^^^
- Warning 53 [misplaced-attribute]: the "inlined" attribute cannot appear in this context
-> compiled  csexp.1.5.2
Processing 114/267: [basement: dune build] [bigarray-compat: dune build] [ocaml-compiler-libs: dune build] [ocaml_intrinsics_kernel: dune build] [re: dune build] [stdlib-shims: dune build]
-> installed csexp.1.5.2
Processing 115/267: [basement: dune build] [bigarray-compat: dune build] [ocaml-compiler-libs: dune build] [ocaml_intrinsics_kernel: dune build] [re: dune build] [stdlib-shims: dune build]
Processing 116/267: [basement: dune build] [bigarray-compat: dune build] [dune-configurator: rm] [ocaml-compiler-libs: dune build] [ocaml_intrinsics_kernel: dune build] [re: dune build] [stdlib-shims: dune build]
+ /home/opam/.opam/opam-init/hooks/sandbox.sh "build" "dune" "build" "-p" "basement" "-j" "255" (CWD=/home/opam/.opam/5.2.0+flambda2/.opam-switch/build/basement.v0.18~preview.130.36+326)
- (cd _build/default && /home/opam/.opam/5.2.0+flambda2/bin/ocamlc.opt -w -40 -g -bin-annot -bin-annot-occurrences -I src/.basement.objs/byte -no-alias-deps -open Basement__ -o src/.basement.objs/byte/basement.cmo -c -impl src/basement.ml)
- File "src/basement.ml", line 10, characters 30-50:
- 10 | module Stdlib_shim_upstream = Stdlib_shim_upstream
-                                    ^^^^^^^^^^^^^^^^^^^^
- Warning 49 [no-cmi-file]: no cmi file was found in path for module Stdlib_shim_upstream
- (cd _build/default && /home/opam/.opam/5.2.0+flambda2/bin/ocamlopt.opt -w -40 -g -O3 -flambda2-inline-max-depth 10 -I src/.basement.objs/byte -I src/.basement.objs/native -intf-suffix .ml -no-alias-deps -open Basement__ -o src/.basement.objs/native/basement.cmx -c -impl src/basement.ml)
- File "src/basement.ml", line 10, characters 30-50:
- 10 | module Stdlib_shim_upstream = Stdlib_shim_upstream
-                                    ^^^^^^^^^^^^^^^^^^^^
- Warning 49 [no-cmi-file]: no cmi file was found in path for module Stdlib_shim_upstream
-> compiled  basement.v0.18~preview.130.36+326
Processing 116/267: [bigarray-compat: dune build] [dune-configurator: rm] [ocaml-compiler-libs: dune build] [ocaml_intrinsics_kernel: dune build] [re: dune build] [stdlib-shims: dune build]
-> installed basement.v0.18~preview.130.36+326
Processing 117/267: [bigarray-compat: dune build] [dune-configurator: rm] [ocaml-compiler-libs: dune build] [ocaml_intrinsics_kernel: dune build] [re: dune build] [stdlib-shims: dune build]
Processing 118/267: [bigarray-compat: dune build] [dune-configurator: rm] [ocaml-compiler-libs: dune build] [ocaml_intrinsics_kernel: dune build] [re: dune build] [sexplib0: dune build] [stdlib-shims: dune build]
+ /home/opam/.opam/opam-init/hooks/sandbox.sh "build" "dune" "build" "-p" "bigarray-compat" "-j" "255" (CWD=/home/opam/.opam/5.2.0+flambda2/.opam-switch/build/bigarray-compat.1.1.0)
-> compiled  bigarray-compat.1.1.0
Processing 118/267: [dune-configurator: rm] [ocaml-compiler-libs: dune build] [ocaml_intrinsics_kernel: dune build] [re: dune build] [sexplib0: dune build] [stdlib-shims: dune build]
-> installed bigarray-compat.1.1.0
Processing 119/267: [dune-configurator: rm] [ocaml-compiler-libs: dune build] [ocaml_intrinsics_kernel: dune build] [re: dune build] [sexplib0: dune build] [stdlib-shims: dune build]
+ /home/opam/.opam/opam-init/hooks/sandbox.sh "build" "dune" "build" "-p" "ocaml_intrinsics_kernel" "-j" "255" (CWD=/home/opam/.opam/5.2.0+flambda2/.opam-switch/build/ocaml_intrinsics_kernel.v0.18~preview.130.36+326)
-> compiled  ocaml_intrinsics_kernel.v0.18~preview.130.36+326
Processing 119/267: [dune-configurator: rm] [ocaml-compiler-libs: dune build] [re: dune build] [sexplib0: dune build] [stdlib-shims: dune build]
-> installed ocaml_intrinsics_kernel.v0.18~preview.130.36+326
Processing 120/267: [dune-configurator: rm] [ocaml-compiler-libs: dune build] [re: dune build] [sexplib0: dune build] [stdlib-shims: dune build]
+ /home/opam/.opam/opam-init/hooks/sandbox.sh "build" "dune" "build" "-p" "stdlib-shims" "-j" "255" (CWD=/home/opam/.opam/5.2.0+flambda2/.opam-switch/build/stdlib-shims.0.3.0)
-> compiled  stdlib-shims.0.3.0
Processing 120/267: [dune-configurator: rm] [ocaml-compiler-libs: dune build] [re: dune build] [sexplib0: dune build]
-> installed stdlib-shims.0.3.0
Processing 121/267: [dune-configurator: rm] [ocaml-compiler-libs: dune build] [re: dune build] [sexplib0: dune build]
Processing 122/267: [dune-configurator: rm] [integers: dune build] [ocaml-compiler-libs: dune build] [re: dune build] [sexplib0: dune build]
+ /home/opam/.opam/opam-init/hooks/sandbox.sh "build" "rm" "-rf" "vendor/csexp" (CWD=/home/opam/.opam/5.2.0+flambda2/.opam-switch/build/dune-configurator.3.19.1)
+ /home/opam/.opam/opam-init/hooks/sandbox.sh "build" "rm" "-rf" "vendor/pp" (CWD=/home/opam/.opam/5.2.0+flambda2/.opam-switch/build/dune-configurator.3.19.1)
Processing 122/267: [dune-configurator: dune build] [integers: dune build] [ocaml-compiler-libs: dune build] [re: dune build] [sexplib0: dune build]
+ /home/opam/.opam/opam-init/hooks/sandbox.sh "build" "dune" "build" "-p" "ocaml-compiler-libs" "-j" "255" (CWD=/home/opam/.opam/5.2.0+flambda2/.opam-switch/build/ocaml-compiler-libs.v0.17.0+ox)
- (cd _build/default && /home/opam/.opam/5.2.0+flambda2/bin/ocamlc.opt -w -40 -safe-string -g -bin-annot -bin-annot-occurrences -I src/ocaml_toplevel/.ocaml_toplevel.objs/byte -I /home/opam/.opam/5.2.0+flambda2/lib/ocaml/compiler-libs -no-alias-deps -o src/ocaml_toplevel/.ocaml_toplevel.objs/byte/ocaml_toplevel.cmo -c -impl src/ocaml_toplevel/ocaml_toplevel.ml)
- File "src/ocaml_toplevel/ocaml_toplevel.ml", line 4, characters 21-30:
- 4 | module Topcommon   = Topcommon
-                          ^^^^^^^^^
- Warning 49 [no-cmi-file]: no cmi file was found in path for module Topcommon
- 
- File "src/ocaml_toplevel/ocaml_toplevel.ml", line 6, characters 21-28:
- 6 | module Topeval     = Topeval
-                          ^^^^^^^
- Warning 49 [no-cmi-file]: no cmi file was found in path for module Topeval
- 
- File "src/ocaml_toplevel/ocaml_toplevel.ml", line 9, characters 21-32:
- 9 | module Topprinters = Topprinters
-                          ^^^^^^^^^^^
- Warning 49 [no-cmi-file]: no cmi file was found in path for module Topprinters
- (cd _build/default && /home/opam/.opam/5.2.0+flambda2/bin/ocamlopt.opt -w -40 -safe-string -g -I src/ocaml_toplevel/.ocaml_toplevel.objs/byte -I src/ocaml_toplevel/.ocaml_toplevel.objs/native -I /home/opam/.opam/5.2.0+flambda2/lib/ocaml/compiler-libs -intf-suffix .ml -no-alias-deps -o src/ocaml_toplevel/.ocaml_toplevel.objs/native/ocaml_toplevel.cmx -c -impl src/ocaml_toplevel/ocaml_toplevel.ml)
- File "src/ocaml_toplevel/ocaml_toplevel.ml", line 4, characters 21-30:
- 4 | module Topcommon   = Topcommon
-                          ^^^^^^^^^
- Warning 49 [no-cmi-file]: no cmi file was found in path for module Topcommon
- 
- File "src/ocaml_toplevel/ocaml_toplevel.ml", line 6, characters 21-28:
- 6 | module Topeval     = Topeval
-                          ^^^^^^^
- Warning 49 [no-cmi-file]: no cmi file was found in path for module Topeval
- 
- File "src/ocaml_toplevel/ocaml_toplevel.ml", line 9, characters 21-32:
- 9 | module Topprinters = Topprinters
-                          ^^^^^^^^^^^
- Warning 49 [no-cmi-file]: no cmi file was found in path for module Topprinters
- (cd _build/default && /home/opam/.opam/5.2.0+flambda2/bin/ocamlc.opt -w -40 -safe-string -g -bin-annot -bin-annot-occurrences -I src/ocaml_optcomp/.ocaml_optcomp.objs/byte -I /home/opam/.opam/5.2.0+flambda2/lib/ocaml/compiler-libs -no-alias-deps -o src/ocaml_optcomp/.ocaml_optcomp.objs/byte/ocaml_optcomp.cmo -c -impl src/ocaml_optcomp/ocaml_optcomp.ml)
- File "src/ocaml_optcomp/ocaml_optcomp.ml", line 438, characters 68-95:
- 438 | module Oxcaml_utils__File_sections                                = Oxcaml_utils__File_sections
-                                                                           ^^^^^^^^^^^^^^^^^^^^^^^^^^^
- Warning 49 [no-cmi-file]: no cmi file was found in path for module Oxcaml_utils__File_sections
- 
- File "src/ocaml_optcomp/ocaml_optcomp.ml", line 439, characters 68-85:
- 439 | module Oxcaml_utils__Lru                                          = Oxcaml_utils__Lru
-                                                                           ^^^^^^^^^^^^^^^^^
- Warning 49 [no-cmi-file]: no cmi file was found in path for module Oxcaml_utils__Lru
- 
- File "src/ocaml_optcomp/ocaml_optcomp.ml", line 474, characters 68-84:
- 474 | module Relocation_table                                           = Relocation_table
-                                                                           ^^^^^^^^^^^^^^^^
- Warning 49 [no-cmi-file]: no cmi file was found in path for module Relocation_table
- 
- File "src/ocaml_optcomp/ocaml_optcomp.ml", line 487, characters 68-80:
- 487 | module Symbol_entry                                               = Symbol_entry
-                                                                           ^^^^^^^^^^^^
- Warning 49 [no-cmi-file]: no cmi file was found in path for module Symbol_entry
- (cd _build/default && /home/opam/.opam/5.2.0+flambda2/bin/ocamlopt.opt -w -40 -safe-string -g -I src/ocaml_optcomp/.ocaml_optcomp.objs/byte -I src/ocaml_optcomp/.ocaml_optcomp.objs/native -I /home/opam/.opam/5.2.0+flambda2/lib/ocaml/compiler-libs -intf-suffix .ml -no-alias-deps -o src/ocaml_optcomp/.ocaml_optcomp.objs/native/ocaml_optcomp.cmx -c -impl src/ocaml_optcomp/ocaml_optcomp.ml)
- File "src/ocaml_optcomp/ocaml_optcomp.ml", line 438, characters 68-95:
- 438 | module Oxcaml_utils__File_sections                                = Oxcaml_utils__File_sections
-                                                                           ^^^^^^^^^^^^^^^^^^^^^^^^^^^
- Warning 49 [no-cmi-file]: no cmi file was found in path for module Oxcaml_utils__File_sections
- 
- File "src/ocaml_optcomp/ocaml_optcomp.ml", line 439, characters 68-85:
- 439 | module Oxcaml_utils__Lru                                          = Oxcaml_utils__Lru
-                                                                           ^^^^^^^^^^^^^^^^^
- Warning 49 [no-cmi-file]: no cmi file was found in path for module Oxcaml_utils__Lru
- 
- File "src/ocaml_optcomp/ocaml_optcomp.ml", line 474, characters 68-84:
- 474 | module Relocation_table                                           = Relocation_table
-                                                                           ^^^^^^^^^^^^^^^^
- Warning 49 [no-cmi-file]: no cmi file was found in path for module Relocation_table
- 
- File "src/ocaml_optcomp/ocaml_optcomp.ml", line 487, characters 68-80:
- 487 | module Symbol_entry                                               = Symbol_entry
-                                                                           ^^^^^^^^^^^^
- Warning 49 [no-cmi-file]: no cmi file was found in path for module Symbol_entry
-> compiled  ocaml-compiler-libs.v0.17.0+ox
Processing 122/267: [dune-configurator: dune build] [integers: dune build] [re: dune build] [sexplib0: dune build]
-> installed ocaml-compiler-libs.v0.17.0+ox
Processing 123/267: [dune-configurator: dune build] [integers: dune build] [re: dune build] [sexplib0: dune build]
+ /home/opam/.opam/opam-init/hooks/sandbox.sh "build" "dune" "build" "-p" "re" "-j" "255" "@install" (CWD=/home/opam/.opam/5.2.0+flambda2/.opam-switch/build/re.1.13.2)
-> compiled  re.1.13.2
Processing 123/267: [dune-configurator: dune build] [integers: dune build] [sexplib0: dune build]
-> installed re.1.13.2
Processing 124/267: [dune-configurator: dune build] [integers: dune build] [sexplib0: dune build]
+ /home/opam/.opam/opam-init/hooks/sandbox.sh "build" "dune" "build" "-p" "integers" "-j" "255" (CWD=/home/opam/.opam/5.2.0+flambda2/.opam-switch/build/integers.0.7.0)
-> compiled  integers.0.7.0
Processing 124/267: [dune-configurator: dune build] [sexplib0: dune build]
-> installed integers.0.7.0
Processing 125/267: [dune-configurator: dune build] [sexplib0: dune build]
+ /home/opam/.opam/opam-init/hooks/sandbox.sh "build" "dune" "build" "-p" "sexplib0" "-j" "255" (CWD=/home/opam/.opam/5.2.0+flambda2/.opam-switch/build/sexplib0.v0.18~preview.130.36+326)
-> compiled  sexplib0.v0.18~preview.130.36+326
Processing 125/267: [dune-configurator: dune build]
-> installed sexplib0.v0.18~preview.130.36+326
Processing 126/267: [dune-configurator: dune build]
Processing 127/267: [dune-configurator: dune build] [parsexp: dune build]
[ppxlib_ast: patch] applying ppxlib+ast+ast.ml.patch
[ppxlib_ast: patch] applying ppxlib+ast+ast_helper_lite.ml.patch
[ppxlib_ast: patch] applying ppxlib+ast+ast_helper_lite.mli.patch
[ppxlib_ast: patch] applying ppxlib+ast+location_error.ml.patch
[ppxlib_ast: patch] applying ppxlib+ast+location_error.mli.patch
[ppxlib_ast: patch] applying ppxlib+ast+supported_version+supported_version.ml.patch
[ppxlib_ast: patch] applying ppxlib+ast+versions.ml.patch
[ppxlib_ast: patch] applying ppxlib+ast+versions.mli.patch
[ppxlib_ast: patch] applying ppxlib+astlib+ast_414.ml.patch
[ppxlib_ast: patch] applying ppxlib+astlib+ast_500.ml.patch
[ppxlib_ast: patch] applying ppxlib+astlib+ast_999.ml.patch
[ppxlib_ast: patch] applying ppxlib+astlib+ast_metadata.mli.patch
[ppxlib_ast: patch] applying ppxlib+astlib+astlib.ml.patch
[ppxlib_ast: patch] applying ppxlib+astlib+cinaps+astlib_cinaps_helpers.ml.patch
[ppxlib_ast: patch] applying ppxlib+astlib+config+gen.ml.patch
[ppxlib_ast: patch] applying ppxlib+astlib+migrate_500_999.ml.patch
[ppxlib_ast: patch] applying ppxlib+astlib+migrate_999_500.ml.patch
[ppxlib_ast: patch] applying ppxlib+astlib+parse.mli.patch
[ppxlib_ast: patch] applying ppxlib+astlib+pprintast.ml.patch
[ppxlib_ast: patch] applying ppxlib+astlib+pprintast.mli.patch
[ppxlib_ast: patch] applying ppxlib+astlib+stdlib0.ml.patch
[ppxlib_ast: patch] applying ppxlib+stdppx+stdppx.ml.patch
[ppxlib_ast: patch] applying dune.patch
Processing 128/267: [dune-configurator: dune build] [parsexp: dune build] [ppxlib_ast: bash]
+ /home/opam/.opam/opam-init/hooks/sandbox.sh "build" "bash" "./cleanup.sh" (CWD=/home/opam/.opam/5.2.0+flambda2/.opam-switch/build/ppxlib_ast.0.33.0+ox)
Processing 128/267: [dune-configurator: dune build] [parsexp: dune build] [ppxlib_ast: dune build]
+ /home/opam/.opam/opam-init/hooks/sandbox.sh "build" "dune" "build" "-p" "dune-configurator" "-j" "255" "@install" (CWD=/home/opam/.opam/5.2.0+flambda2/.opam-switch/build/dune-configurator.3.19.1)
-> compiled  dune-configurator.3.19.1
Processing 128/267: [parsexp: dune build] [ppxlib_ast: dune build]
-> installed dune-configurator.3.19.1
Processing 129/267: [parsexp: dune build] [ppxlib_ast: dune build]
Processing 130/267: [ctypes: dune build] [parsexp: dune build] [ppxlib_ast: dune build]
+ /home/opam/.opam/opam-init/hooks/sandbox.sh "build" "dune" "build" "-p" "parsexp" "-j" "255" (CWD=/home/opam/.opam/5.2.0+flambda2/.opam-switch/build/parsexp.v0.18~preview.130.36+326)
-> compiled  parsexp.v0.18~preview.130.36+326
Processing 130/267: [ctypes: dune build] [ppxlib_ast: dune build]
-> installed parsexp.v0.18~preview.130.36+326
Processing 131/267: [ctypes: dune build] [ppxlib_ast: dune build]
Processing 132/267: [ctypes: dune build] [ppxlib_ast: dune build] [sexplib: dune build]
+ /home/opam/.opam/opam-init/hooks/sandbox.sh "build" "dune" "build" "-p" "sexplib" "-j" "255" (CWD=/home/opam/.opam/5.2.0+flambda2/.opam-switch/build/sexplib.v0.18~preview.130.36+326)
-> compiled  sexplib.v0.18~preview.130.36+326
Processing 132/267: [ctypes: dune build] [ppxlib_ast: dune build]
-> installed sexplib.v0.18~preview.130.36+326
Processing 133/267: [ctypes: dune build] [ppxlib_ast: dune build]
+ /home/opam/.opam/opam-init/hooks/sandbox.sh "build" "dune" "build" "-p" "ctypes" "-j" "255" "--promote-install-files=false" "@install" (CWD=/home/opam/.opam/5.2.0+flambda2/.opam-switch/build/ctypes.0.23.0)
- (cd _build/default && /home/opam/.opam/5.2.0+flambda2/bin/ocamlc.opt -w -40 -g -bin-annot -bin-annot-occurrences -I src/ctypes/.ctypes.objs/byte -I /home/opam/.opam/5.2.0+flambda2/lib/bigarray-compat -I /home/opam/.opam/5.2.0+flambda2/lib/integers -I /home/opam/.opam/5.2.0+flambda2/lib/stdlib-shims -intf-suffix .ml -no-alias-deps -o src/ctypes/.ctypes.objs/byte/ctypes_coerce.cmo -c -impl src/ctypes/ctypes_coerce.ml)
- File "src/ctypes/ctypes_coerce.ml", line 31, characters 9-34:
- 31 | let () = Printexc.register_printer show_uncoercible
-               ^^^^^^^^^^^^^^^^^^^^^^^^^
- Alert unsafe_multidomain: Stdlib.Printexc.register_printer
- Use [Printexc.Safe.register_printer].
- (cd _build/default && /home/opam/.opam/5.2.0+flambda2/bin/ocamlopt.opt -w -40 -g -I src/ctypes/.ctypes.objs/byte -I src/ctypes/.ctypes.objs/native -I /home/opam/.opam/5.2.0+flambda2/lib/bigarray-compat -I /home/opam/.opam/5.2.0+flambda2/lib/integers -I /home/opam/.opam/5.2.0+flambda2/lib/stdlib-shims -intf-suffix .ml -no-alias-deps -o src/ctypes/.ctypes.objs/native/ctypes_coerce.cmx -c -impl src/ctypes/ctypes_coerce.ml)
- File "src/ctypes/ctypes_coerce.ml", line 31, characters 9-34:
- 31 | let () = Printexc.register_printer show_uncoercible
-               ^^^^^^^^^^^^^^^^^^^^^^^^^
- Alert unsafe_multidomain: Stdlib.Printexc.register_printer
- Use [Printexc.Safe.register_printer].
- (cd _build/default && /home/opam/.opam/5.2.0+flambda2/bin/ocamlopt.opt -w -40 -g -I src/ctypes-top/.ctypes_top.objs/byte -I src/ctypes-top/.ctypes_top.objs/native -I /home/opam/.opam/5.2.0+flambda2/lib/bigarray-compat -I /home/opam/.opam/5.2.0+flambda2/lib/integers -I /home/opam/.opam/5.2.0+flambda2/lib/ocaml/compiler-libs -I /home/opam/.opam/5.2.0+flambda2/lib/stdlib-shims -I src/ctypes/.ctypes.objs/byte -I src/ctypes/.ctypes.objs/native -intf-suffix .ml -no-alias-deps -open Ctypes_top -o src/ctypes-top/.ctypes_top.objs/native/ctypes_top__Install_ctypes_printers.cmx -c -impl src/ctypes-top/install_ctypes_printers.ml)
- File "_none_", line 1:
- Warning 58 [no-cmx-file]: no cmx file was found in path for module Toploop, and its interface was not compiled with -opaque
Processing 133/267: [ctypes: dune install] [ppxlib_ast: dune build]
+ /home/opam/.opam/opam-init/hooks/sandbox.sh "build" "dune" "install" "-p" "ctypes" "--create-install-files" "ctypes" (CWD=/home/opam/.opam/5.2.0+flambda2/.opam-switch/build/ctypes.0.23.0)
-> compiled  ctypes.0.23.0
Processing 133/267: [ppxlib_ast: dune build]
-> installed ctypes.0.23.0
Processing 134/267: [ppxlib_ast: dune build]
Processing 135/267: [ctypes-foreign: dune build] [ppxlib_ast: dune build]
+ /home/opam/.opam/opam-init/hooks/sandbox.sh "build" "dune" "build" "-p" "ctypes-foreign" "-j" "255" "--promote-install-files=false" "@install" (CWD=/home/opam/.opam/5.2.0+flambda2/.opam-switch/build/ctypes-foreign.0.23.0)
- (cd _build/default && /home/opam/.opam/5.2.0+flambda2/bin/ocamlc.opt -w -40 -g -bin-annot -bin-annot-occurrences -I src/ctypes-foreign/.ctypes_foreign.objs/byte -I src/ctypes-foreign/.ctypes_foreign.objs/public_cmi -I /home/opam/.opam/5.2.0+flambda2/lib/bigarray-compat -I /home/opam/.opam/5.2.0+flambda2/lib/ctypes -I /home/opam/.opam/5.2.0+flambda2/lib/integers -I /home/opam/.opam/5.2.0+flambda2/lib/ocaml/threads -I /home/opam/.opam/5.2.0+flambda2/lib/ocaml/unix -I /home/opam/.opam/5.2.0+flambda2/lib/stdlib-shims -no-alias-deps -o src/ctypes-foreign/.ctypes_foreign.objs/byte/ctypes_ffi_stubs.cmo -c -impl src/ctypes-foreign/ctypes_ffi_stubs.ml)
- File "src/ctypes-foreign/ctypes_ffi_stubs.ml", line 86, characters 9-36:
- 86 | let () = Callback.register_exception "FFI_internal_error"
-               ^^^^^^^^^^^^^^^^^^^^^^^^^^^
- Alert unsafe_multidomain: Stdlib.Callback.register_exception
- Use [Callback.Safe.register_exception].
- 
- File "src/ctypes-foreign/ctypes_ffi_stubs.ml", line 92, characters 9-36:
- 92 | let () = Callback.register_exception "CallToExpiredClosure"
-               ^^^^^^^^^^^^^^^^^^^^^^^^^^^
- Alert unsafe_multidomain: Stdlib.Callback.register_exception
- Use [Callback.Safe.register_exception].
- (cd _build/default && /home/opam/.opam/5.2.0+flambda2/bin/ocamlopt.opt -w -40 -g -I src/ctypes-foreign/.ctypes_foreign.objs/byte -I src/ctypes-foreign/.ctypes_foreign.objs/native -I src/ctypes-foreign/.ctypes_foreign.objs/public_cmi -I /home/opam/.opam/5.2.0+flambda2/lib/bigarray-compat -I /home/opam/.opam/5.2.0+flambda2/lib/ctypes -I /home/opam/.opam/5.2.0+flambda2/lib/integers -I /home/opam/.opam/5.2.0+flambda2/lib/ocaml/threads -I /home/opam/.opam/5.2.0+flambda2/lib/ocaml/unix -I /home/opam/.opam/5.2.0+flambda2/lib/stdlib-shims -intf-suffix .ml -no-alias-deps -o src/ctypes-foreign/.ctypes_foreign.objs/native/ctypes_ffi_stubs.cmx -c -impl src/ctypes-foreign/ctypes_ffi_stubs.ml)
- File "src/ctypes-foreign/ctypes_ffi_stubs.ml", line 86, characters 9-36:
- 86 | let () = Callback.register_exception "FFI_internal_error"
-               ^^^^^^^^^^^^^^^^^^^^^^^^^^^
- Alert unsafe_multidomain: Stdlib.Callback.register_exception
- Use [Callback.Safe.register_exception].
- 
- File "src/ctypes-foreign/ctypes_ffi_stubs.ml", line 92, characters 9-36:
- 92 | let () = Callback.register_exception "CallToExpiredClosure"
-               ^^^^^^^^^^^^^^^^^^^^^^^^^^^
- Alert unsafe_multidomain: Stdlib.Callback.register_exception
- Use [Callback.Safe.register_exception].
Processing 135/267: [ctypes-foreign: dune install] [ppxlib_ast: dune build]
+ /home/opam/.opam/opam-init/hooks/sandbox.sh "build" "dune" "install" "-p" "ctypes-foreign" "--create-install-files" "ctypes-foreign" (CWD=/home/opam/.opam/5.2.0+flambda2/.opam-switch/build/ctypes-foreign.0.23.0)
-> compiled  ctypes-foreign.0.23.0
Processing 135/267: [ppxlib_ast: dune build]
-> installed ctypes-foreign.0.23.0
Processing 136/267: [ppxlib_ast: dune build]
+ /home/opam/.opam/opam-init/hooks/sandbox.sh "build" "dune" "build" "-p" "ppxlib_ast" "-j" "255" "@install" (CWD=/home/opam/.opam/5.2.0+flambda2/.opam-switch/build/ppxlib_ast.0.33.0+ox)
-> compiled  ppxlib_ast.0.33.0+ox
-> installed ppxlib_ast.0.33.0+ox
Processing 138/267: [ppxlib_jane: dune build]
+ /home/opam/.opam/opam-init/hooks/sandbox.sh "build" "dune" "build" "-p" "ppxlib_jane" "-j" "255" (CWD=/home/opam/.opam/5.2.0+flambda2/.opam-switch/build/ppxlib_jane.v0.18~preview.130.36+326)
-> compiled  ppxlib_jane.v0.18~preview.130.36+326
-> installed ppxlib_jane.v0.18~preview.130.36+326
[ppxlib: patch] applying ppxlib+doc+writing_ppxs.mld.patch
[ppxlib: patch] applying ppxlib+metaquot+ppxlib_metaquot.ml.patch
[ppxlib: patch] applying ppxlib+runner_as_ppx+ppxlib_runner_as_ppx.ml.patch
[ppxlib: patch] applying ppxlib+src+ast_builder.ml.patch
[ppxlib: patch] applying ppxlib+src+ast_builder.mli.patch
[ppxlib: patch] applying ppxlib+src+ast_builder_intf.ml.patch
[ppxlib: patch] applying ppxlib+src+ast_pattern.ml.patch
[ppxlib: patch] applying ppxlib+src+ast_pattern.mli.patch
[ppxlib: patch] applying ppxlib+src+ast_traverse.ml.patch
[ppxlib: patch] applying ppxlib+src+attribute.ml.patch
[ppxlib: patch] applying ppxlib+src+attribute.mli.patch
[ppxlib: patch] applying ppxlib+src+cinaps+ppxlib_cinaps_helpers.ml.patch
[ppxlib: patch] applying ppxlib+src+code_matcher.ml.patch
[ppxlib: patch] applying ppxlib+src+code_matcher.mli.patch
[ppxlib: patch] applying ppxlib+src+common.ml.patch
[ppxlib: patch] applying ppxlib+src+common.mli.patch
[ppxlib: patch] applying ppxlib+src+context_free.ml.patch
[ppxlib: patch] applying ppxlib+src+context_free.mli.patch
[ppxlib: patch] applying ppxlib+src+deriving.ml.patch
[ppxlib: patch] applying ppxlib+src+deriving.mli.patch
[ppxlib: patch] applying ppxlib+src+driver.ml.patch
[ppxlib: patch] applying ppxlib+src+driver.mli.patch
[ppxlib: patch] applying ppxlib+src+gen+gen_ast_builder.ml.patch
[ppxlib: patch] applying ppxlib+src+gen+gen_ast_pattern.ml.patch
[ppxlib: patch] applying ppxlib+src+gen+import.ml.patch
[ppxlib: patch] applying ppxlib+src+ignore_unused_warning.ml.patch
[ppxlib: patch] applying ppxlib+src+location.ml.patch
[ppxlib: patch] applying ppxlib+src+location.mli.patch
[ppxlib: patch] applying ppxlib+src+name.ml.patch
[ppxlib: patch] applying ppxlib+src+utils.mli.patch
[ppxlib: patch] applying ppxlib+traverse+ppxlib_traverse.ml.patch
[ppxlib: patch] applying dune.patch
[ppxlib: patch] applying location_check.ml.patch
[ppxlib: patch] applying utils.ml.patch
Processing 140/267: [ppxlib: rm ast]
+ /home/opam/.opam/opam-init/hooks/sandbox.sh "build" "rm" "-rf" "ast" "astlib" "stdppx" "traverse_builtins" (CWD=/home/opam/.opam/5.2.0+flambda2/.opam-switch/build/ppxlib.0.33.0+ox)
Processing 140/267: [ppxlib: dune build]
+ /home/opam/.opam/opam-init/hooks/sandbox.sh "build" "dune" "build" "-p" "ppxlib" "-j" "255" "@install" (CWD=/home/opam/.opam/5.2.0+flambda2/.opam-switch/build/ppxlib.0.33.0+ox)
- (cd _build/default && /home/opam/.opam/5.2.0+flambda2/bin/ocamlopt.opt -w -40 -safe-string -g -I src/gen/.gen_ast_pattern.eobjs/byte -I src/gen/.gen_ast_pattern.eobjs/native -I /home/opam/.opam/5.2.0+flambda2/lib/ppxlib_ast/ast -I /home/opam/.opam/5.2.0+flambda2/lib/ppxlib_ast/astlib -I /home/opam/.opam/5.2.0+flambda2/lib/ppxlib_ast/stdppx -I /home/opam/.opam/5.2.0+flambda2/lib/ppxlib_ast/traverse_builtins -I /home/opam/.opam/5.2.0+flambda2/lib/ppxlib_jane -I /home/opam/.opam/5.2.0+flambda2/lib/stdlib-shims -I shims/ast/.ppxlib_ast.objs/byte -I shims/ast/.ppxlib_ast.objs/native -I shims/astlib/.astlib.objs/byte -I shims/astlib/.astlib.objs/native -I shims/stdppx/.stdppx.objs/byte -I shims/stdppx/.stdppx.objs/native -I shims/traverse_builtins/.ppxlib_traverse_builtins.objs/byte -I shims/traverse_builtins/.ppxlib_traverse_builtins.objs/native -intf-suffix .ml -no-alias-deps -open Dune__exe -o src/gen/.gen_ast_pattern.eobjs/native/dune__exe__Import.cmx -c -impl src/gen/import.ml)
- File "_none_", line 1:
- Warning 58 [no-cmx-file]: no cmx file was found in path for module Location, and its interface was not compiled with -opaque
- 
- File "_none_", line 1:
- Warning 58 [no-cmx-file]: no cmx file was found in path for module Longident, and its interface was not compiled with -opaque
- (cd _build/default && /home/opam/.opam/5.2.0+flambda2/bin/ocamlopt.opt -w -40 -safe-string -g -I src/gen/.gen_ast_pattern.eobjs/byte -I src/gen/.gen_ast_pattern.eobjs/native -I /home/opam/.opam/5.2.0+flambda2/lib/ppxlib_ast/ast -I /home/opam/.opam/5.2.0+flambda2/lib/ppxlib_ast/astlib -I /home/opam/.opam/5.2.0+flambda2/lib/ppxlib_ast/stdppx -I /home/opam/.opam/5.2.0+flambda2/lib/ppxlib_ast/traverse_builtins -I /home/opam/.opam/5.2.0+flambda2/lib/ppxlib_jane -I /home/opam/.opam/5.2.0+flambda2/lib/stdlib-shims -I shims/ast/.ppxlib_ast.objs/byte -I shims/ast/.ppxlib_ast.objs/native -I shims/astlib/.astlib.objs/byte -I shims/astlib/.astlib.objs/native -I shims/stdppx/.stdppx.objs/byte -I shims/stdppx/.stdppx.objs/native -I shims/traverse_builtins/.ppxlib_traverse_builtins.objs/byte -I shims/traverse_builtins/.ppxlib_traverse_builtins.objs/native -intf-suffix .ml -no-alias-deps -open Dune__exe -o src/gen/.gen_ast_pattern.eobjs/native/dune__exe__Gen_ast_builder.cmx -c -impl src/gen/gen_ast_builder.ml)
- File "_none_", line 1:
- Warning 58 [no-cmx-file]: no cmx file was found in path for module Location, and its interface was not compiled with -opaque
- (cd _build/default && /home/opam/.opam/5.2.0+flambda2/bin/ocamlopt.opt -w -40 -safe-string -g -I src/gen/.gen_ast_pattern.eobjs/byte -I src/gen/.gen_ast_pattern.eobjs/native -I /home/opam/.opam/5.2.0+flambda2/lib/ppxlib_ast/ast -I /home/opam/.opam/5.2.0+flambda2/lib/ppxlib_ast/astlib -I /home/opam/.opam/5.2.0+flambda2/lib/ppxlib_ast/stdppx -I /home/opam/.opam/5.2.0+flambda2/lib/ppxlib_ast/traverse_builtins -I /home/opam/.opam/5.2.0+flambda2/lib/ppxlib_jane -I /home/opam/.opam/5.2.0+flambda2/lib/stdlib-shims -I shims/ast/.ppxlib_ast.objs/byte -I shims/ast/.ppxlib_ast.objs/native -I shims/astlib/.astlib.objs/byte -I shims/astlib/.astlib.objs/native -I shims/stdppx/.stdppx.objs/byte -I shims/stdppx/.stdppx.objs/native -I shims/traverse_builtins/.ppxlib_traverse_builtins.objs/byte -I shims/traverse_builtins/.ppxlib_traverse_builtins.objs/native -intf-suffix .ml -no-alias-deps -open Dune__exe -o src/gen/.gen_ast_pattern.eobjs/native/dune__exe__Gen_ast_pattern.cmx -c -impl src/gen/gen_ast_pattern.ml)
- File "_none_", line 1:
- Warning 58 [no-cmx-file]: no cmx file was found in path for module Location, and its interface was not compiled with -opaque
- (cd _build/default && /home/opam/.opam/5.2.0+flambda2/bin/ocamlc.opt -w -40 -safe-string -open Ocaml_shadow -g -bin-annot -bin-annot-occurrences -I src/.ppxlib.objs/byte -I /home/opam/.opam/5.2.0+flambda2/lib/ocaml-compiler-libs/common -I /home/opam/.opam/5.2.0+flambda2/lib/ocaml-compiler-libs/shadow -I /home/opam/.opam/5.2.0+flambda2/lib/ocaml/compiler-libs -I /home/opam/.opam/5.2.0+flambda2/lib/ppx_derivers -I /home/opam/.opam/5.2.0+flambda2/lib/ppxlib_ast/ast -I /home/opam/.opam/5.2.0+flambda2/lib/ppxlib_ast/astlib -I /home/opam/.opam/5.2.0+flambda2/lib/ppxlib_ast/stdppx -I /home/opam/.opam/5.2.0+flambda2/lib/ppxlib_ast/traverse_builtins -I /home/opam/.opam/5.2.0+flambda2/lib/ppxlib_jane -I /home/opam/.opam/5.2.0+flambda2/lib/sexplib0 -I /home/opam/.opam/5.2.0+flambda2/lib/stdlib-shims -I print-diff/.ppxlib_print_diff.objs/byte -I shims/ast/.ppxlib_ast.objs/byte -I shims/astlib/.astlib.objs/byte -I shims/stdppx/.stdppx.objs/byte -I shims/traverse_builtins/.ppxlib_traverse_builtins.objs/byte -no-alias-deps -open Ppxlib__ -o src/.ppxlib.objs/byte/ppxlib__Ast_pattern_generated.cmo -c -impl src/ast_pattern_generated.ml)
- File "src/ast_pattern_generated.ml", line 1584, characters 9-10:
- 1584 |        | _ -> fail loc "Modality")
-                 ^
- Warning 11 [redundant-case]: this match case is unused.
- 
- File "src/ast_pattern_generated.ml", line 1591, characters 9-10:
- 1591 |        | _ -> fail loc "Mode")
-                 ^
- Warning 11 [redundant-case]: this match case is unused.
- (cd _build/default && /home/opam/.opam/5.2.0+flambda2/bin/ocamlopt.opt -w -40 -safe-string -open Ocaml_shadow -g -I src/.ppxlib.objs/byte -I src/.ppxlib.objs/native -I /home/opam/.opam/5.2.0+flambda2/lib/ocaml-compiler-libs/common -I /home/opam/.opam/5.2.0+flambda2/lib/ocaml-compiler-libs/shadow -I /home/opam/.opam/5.2.0+flambda2/lib/ocaml/compiler-libs -I /home/opam/.opam/5.2.0+flambda2/lib/ppx_derivers -I /home/opam/.opam/5.2.0+flambda2/lib/ppxlib_ast/ast -I /home/opam/.opam/5.2.0+flambda2/lib/ppxlib_ast/astlib -I /home/opam/.opam/5.2.0+flambda2/lib/ppxlib_ast/stdppx -I /home/opam/.opam/5.2.0+flambda2/lib/ppxlib_ast/traverse_builtins -I /home/opam/.opam/5.2.0+flambda2/lib/ppxlib_jane -I /home/opam/.opam/5.2.0+flambda2/lib/sexplib0 -I /home/opam/.opam/5.2.0+flambda2/lib/stdlib-shims -I print-diff/.ppxlib_print_diff.objs/byte -I print-diff/.ppxlib_print_diff.objs/native -I shims/ast/.ppxlib_ast.objs/byte -I shims/ast/.ppxlib_ast.objs/native -I shims/astlib/.astlib.objs/byte -I shims/astlib/.astlib.objs/native -I shims/stdppx/.stdppx.objs/byte -I shims/stdppx/.stdppx.objs/native -I shims/traverse_builtins/.ppxlib_traverse_builtins.objs/byte -I shims/traverse_builtins/.ppxlib_traverse_builtins.objs/native -intf-suffix .ml -no-alias-deps -open Ppxlib__ -o src/.ppxlib.objs/native/ppxlib__Ast_pattern_generated.cmx -c -impl src/ast_pattern_generated.ml)
- File "src/ast_pattern_generated.ml", line 1584, characters 9-10:
- 1584 |        | _ -> fail loc "Modality")
-                 ^
- Warning 11 [redundant-case]: this match case is unused.
- 
- File "src/ast_pattern_generated.ml", line 1591, characters 9-10:
- 1591 |        | _ -> fail loc "Mode")
-                 ^
- Warning 11 [redundant-case]: this match case is unused.
- (cd _build/default && /home/opam/.opam/5.2.0+flambda2/bin/ocamlopt.opt -w -40 -safe-string -g -I metaquot/.ppxlib_metaquot.objs/byte -I metaquot/.ppxlib_metaquot.objs/native -I /home/opam/.opam/5.2.0+flambda2/lib/ppxlib_ast/ast -I /home/opam/.opam/5.2.0+flambda2/lib/ppxlib_ast/astlib -I /home/opam/.opam/5.2.0+flambda2/lib/ppxlib_ast/traverse_builtins -I metaquot_lifters/.ppxlib_metaquot_lifters.objs/byte -I metaquot_lifters/.ppxlib_metaquot_lifters.objs/native -I shims/ast/.ppxlib_ast.objs/byte -I shims/ast/.ppxlib_ast.objs/native -I shims/astlib/.astlib.objs/byte -I shims/astlib/.astlib.objs/native -I shims/traverse_builtins/.ppxlib_traverse_builtins.objs/byte -I shims/traverse_builtins/.ppxlib_traverse_builtins.objs/native -I src/.ppxlib.objs/byte -I src/.ppxlib.objs/native -intf-suffix .ml -no-alias-deps -o metaquot/.ppxlib_metaquot.objs/native/ppxlib_metaquot.cmx -c -impl metaquot/ppxlib_metaquot.ml)
- File "_none_", line 1:
- Warning 58 [no-cmx-file]: no cmx file was found in path for module Ppxlib_jane__Shim, and its interface was not compiled with -opaque
- (cd _build/default && /home/opam/.opam/5.2.0+flambda2/bin/ocamlopt.opt -w -40 -safe-string -g -I traverse/.ppxlib_traverse.objs/byte -I traverse/.ppxlib_traverse.objs/native -I /home/opam/.opam/5.2.0+flambda2/lib/ppxlib_ast/ast -I /home/opam/.opam/5.2.0+flambda2/lib/ppxlib_ast/stdppx -I /home/opam/.opam/5.2.0+flambda2/lib/ppxlib_ast/traverse_builtins -I /home/opam/.opam/5.2.0+flambda2/lib/ppxlib_jane -I /home/opam/.opam/5.2.0+flambda2/lib/stdlib-shims -I shims/ast/.ppxlib_ast.objs/byte -I shims/ast/.ppxlib_ast.objs/native -I shims/stdppx/.stdppx.objs/byte -I shims/stdppx/.stdppx.objs/native -I shims/traverse_builtins/.ppxlib_traverse_builtins.objs/byte -I shims/traverse_builtins/.ppxlib_traverse_builtins.objs/native -I src/.ppxlib.objs/byte -I src/.ppxlib.objs/native -intf-suffix .ml -no-alias-deps -o traverse/.ppxlib_traverse.objs/native/ppxlib_traverse.cmx -c -impl traverse/ppxlib_traverse.pp.ml)
- File "_none_", line 1:
- Warning 58 [no-cmx-file]: no cmx file was found in path for module Astlib__Location, and its interface was not compiled with -opaque
-> compiled  ppxlib.0.33.0+ox
-> installed ppxlib.0.33.0+ox
Processing 142/267: [ppx_cold: dune build]
Processing 143/267: [ppx_cold: dune build] [ppx_compare: dune build]
Processing 144/267: [ppx_cold: dune build] [ppx_compare: dune build] [ppx_enumerate: dune build]
Processing 145/267: [ppx_cold: dune build] [ppx_compare: dune build] [ppx_enumerate: dune build] [ppx_globalize: dune build]
Processing 146/267: [ppx_cold: dune build] [ppx_compare: dune build] [ppx_enumerate: dune build] [ppx_globalize: dune build] [ppx_helpers: dune build]
Processing 147/267: [ppx_cold: dune build] [ppx_compare: dune build] [ppx_enumerate: dune build] [ppx_globalize: dune build] [ppx_helpers: dune build] [ppx_ignore_instrumentation: dune build]
Processing 148/267: [ppx_cold: dune build] [ppx_compare: dune build] [ppx_enumerate: dune build] [ppx_globalize: dune build] [ppx_helpers: dune build] [ppx_ignore_instrumentation: dune build] [ppx_pipebang: dune build]
Processing 149/267: [ppx_cold: dune build] [ppx_compare: dune build] [ppx_enumerate: dune build] [ppx_globalize: dune build] [ppx_helpers: dune build] [ppx_ignore_instrumentation: dune build] [ppx_pipebang: dune build] [ppx_shorthand: dune build]
Processing 150/267: [ppx_cold: dune build] [ppx_compare: dune build] [ppx_enumerate: dune build] [ppx_globalize: dune build] [ppx_helpers: dune build] [ppx_ignore_instrumentation: dune build] [ppx_pipebang: dune build] [ppx_shorthand: dune build] [ppx_template: dune build]
+ /home/opam/.opam/opam-init/hooks/sandbox.sh "build" "dune" "build" "-p" "ppx_helpers" "-j" "255" (CWD=/home/opam/.opam/5.2.0+flambda2/.opam-switch/build/ppx_helpers.v0.18~preview.130.36+326)
-> compiled  ppx_helpers.v0.18~preview.130.36+326
Processing 150/267: [ppx_cold: dune build] [ppx_compare: dune build] [ppx_enumerate: dune build] [ppx_globalize: dune build] [ppx_ignore_instrumentation: dune build] [ppx_pipebang: dune build] [ppx_shorthand: dune build] [ppx_template: dune build]
-> installed ppx_helpers.v0.18~preview.130.36+326
Processing 151/267: [ppx_cold: dune build] [ppx_compare: dune build] [ppx_enumerate: dune build] [ppx_globalize: dune build] [ppx_ignore_instrumentation: dune build] [ppx_pipebang: dune build] [ppx_shorthand: dune build] [ppx_template: dune build]
Processing 152/267: [ppx_cold: dune build] [ppx_compare: dune build] [ppx_enumerate: dune build] [ppx_globalize: dune build] [ppx_ignore_instrumentation: dune build] [ppx_pipebang: dune build] [ppx_sexp_conv: dune build] [ppx_shorthand: dune build] [ppx_template: dune build]
+ /home/opam/.opam/opam-init/hooks/sandbox.sh "build" "dune" "build" "-p" "ppx_cold" "-j" "255" (CWD=/home/opam/.opam/5.2.0+flambda2/.opam-switch/build/ppx_cold.v0.18~preview.130.36+326)
-> compiled  ppx_cold.v0.18~preview.130.36+326
Processing 152/267: [ppx_compare: dune build] [ppx_enumerate: dune build] [ppx_globalize: dune build] [ppx_ignore_instrumentation: dune build] [ppx_pipebang: dune build] [ppx_sexp_conv: dune build] [ppx_shorthand: dune build] [ppx_template: dune build]
-> installed ppx_cold.v0.18~preview.130.36+326
Processing 153/267: [ppx_compare: dune build] [ppx_enumerate: dune build] [ppx_globalize: dune build] [ppx_ignore_instrumentation: dune build] [ppx_pipebang: dune build] [ppx_sexp_conv: dune build] [ppx_shorthand: dune build] [ppx_template: dune build]
+ /home/opam/.opam/opam-init/hooks/sandbox.sh "build" "dune" "build" "-p" "ppx_globalize" "-j" "255" (CWD=/home/opam/.opam/5.2.0+flambda2/.opam-switch/build/ppx_globalize.v0.18~preview.130.36+326)
-> compiled  ppx_globalize.v0.18~preview.130.36+326
Processing 153/267: [ppx_compare: dune build] [ppx_enumerate: dune build] [ppx_ignore_instrumentation: dune build] [ppx_pipebang: dune build] [ppx_sexp_conv: dune build] [ppx_shorthand: dune build] [ppx_template: dune build]
-> installed ppx_globalize.v0.18~preview.130.36+326
Processing 154/267: [ppx_compare: dune build] [ppx_enumerate: dune build] [ppx_ignore_instrumentation: dune build] [ppx_pipebang: dune build] [ppx_sexp_conv: dune build] [ppx_shorthand: dune build] [ppx_template: dune build]
+ /home/opam/.opam/opam-init/hooks/sandbox.sh "build" "dune" "build" "-p" "ppx_enumerate" "-j" "255" (CWD=/home/opam/.opam/5.2.0+flambda2/.opam-switch/build/ppx_enumerate.v0.18~preview.130.36+326)
-> compiled  ppx_enumerate.v0.18~preview.130.36+326
Processing 154/267: [ppx_compare: dune build] [ppx_ignore_instrumentation: dune build] [ppx_pipebang: dune build] [ppx_sexp_conv: dune build] [ppx_shorthand: dune build] [ppx_template: dune build]
-> installed ppx_enumerate.v0.18~preview.130.36+326
Processing 155/267: [ppx_compare: dune build] [ppx_ignore_instrumentation: dune build] [ppx_pipebang: dune build] [ppx_sexp_conv: dune build] [ppx_shorthand: dune build] [ppx_template: dune build]
+ /home/opam/.opam/opam-init/hooks/sandbox.sh "build" "dune" "build" "-p" "ppx_ignore_instrumentation" "-j" "255" (CWD=/home/opam/.opam/5.2.0+flambda2/.opam-switch/build/ppx_ignore_instrumentation.v0.18~preview.130.36+326)
-> compiled  ppx_ignore_instrumentation.v0.18~preview.130.36+326
Processing 155/267: [ppx_compare: dune build] [ppx_pipebang: dune build] [ppx_sexp_conv: dune build] [ppx_shorthand: dune build] [ppx_template: dune build]
-> installed ppx_ignore_instrumentation.v0.18~preview.130.36+326
Processing 156/267: [ppx_compare: dune build] [ppx_pipebang: dune build] [ppx_sexp_conv: dune build] [ppx_shorthand: dune build] [ppx_template: dune build]
+ /home/opam/.opam/opam-init/hooks/sandbox.sh "build" "dune" "build" "-p" "ppx_pipebang" "-j" "255" (CWD=/home/opam/.opam/5.2.0+flambda2/.opam-switch/build/ppx_pipebang.v0.18~preview.130.36+326)
-> compiled  ppx_pipebang.v0.18~preview.130.36+326
Processing 156/267: [ppx_compare: dune build] [ppx_sexp_conv: dune build] [ppx_shorthand: dune build] [ppx_template: dune build]
-> installed ppx_pipebang.v0.18~preview.130.36+326
Processing 157/267: [ppx_compare: dune build] [ppx_sexp_conv: dune build] [ppx_shorthand: dune build] [ppx_template: dune build]
+ /home/opam/.opam/opam-init/hooks/sandbox.sh "build" "dune" "build" "-p" "ppx_compare" "-j" "255" (CWD=/home/opam/.opam/5.2.0+flambda2/.opam-switch/build/ppx_compare.v0.18~preview.130.36+326)
-> compiled  ppx_compare.v0.18~preview.130.36+326
Processing 157/267: [ppx_sexp_conv: dune build] [ppx_shorthand: dune build] [ppx_template: dune build]
-> installed ppx_compare.v0.18~preview.130.36+326
Processing 158/267: [ppx_sexp_conv: dune build] [ppx_shorthand: dune build] [ppx_template: dune build]
+ /home/opam/.opam/opam-init/hooks/sandbox.sh "build" "dune" "build" "-p" "ppx_shorthand" "-j" "255" (CWD=/home/opam/.opam/5.2.0+flambda2/.opam-switch/build/ppx_shorthand.v0.18~preview.130.36+326)
-> compiled  ppx_shorthand.v0.18~preview.130.36+326
Processing 158/267: [ppx_sexp_conv: dune build] [ppx_template: dune build]
-> installed ppx_shorthand.v0.18~preview.130.36+326
Processing 159/267: [ppx_sexp_conv: dune build] [ppx_template: dune build]
+ /home/opam/.opam/opam-init/hooks/sandbox.sh "build" "dune" "build" "-p" "ppx_sexp_conv" "-j" "255" (CWD=/home/opam/.opam/5.2.0+flambda2/.opam-switch/build/ppx_sexp_conv.v0.18~preview.130.36+326)
-> compiled  ppx_sexp_conv.v0.18~preview.130.36+326
Processing 159/267: [ppx_template: dune build]
-> installed ppx_sexp_conv.v0.18~preview.130.36+326
Processing 160/267: [ppx_template: dune build]
Processing 161/267: [ppx_hash: dune build] [ppx_template: dune build]
+ /home/opam/.opam/opam-init/hooks/sandbox.sh "build" "dune" "build" "-p" "ppx_template" "-j" "255" (CWD=/home/opam/.opam/5.2.0+flambda2/.opam-switch/build/ppx_template.v0.18~preview.130.36+326)
-> compiled  ppx_template.v0.18~preview.130.36+326
Processing 161/267: [ppx_hash: dune build]
-> installed ppx_template.v0.18~preview.130.36+326
Processing 162/267: [ppx_hash: dune build]
+ /home/opam/.opam/opam-init/hooks/sandbox.sh "build" "dune" "build" "-p" "ppx_hash" "-j" "255" (CWD=/home/opam/.opam/5.2.0+flambda2/.opam-switch/build/ppx_hash.v0.18~preview.130.36+326)
-> compiled  ppx_hash.v0.18~preview.130.36+326
-> installed ppx_hash.v0.18~preview.130.36+326
Processing 164/267: [ppx_base: dune build]
+ /home/opam/.opam/opam-init/hooks/sandbox.sh "build" "dune" "build" "-p" "ppx_base" "-j" "255" (CWD=/home/opam/.opam/5.2.0+flambda2/.opam-switch/build/ppx_base.v0.18~preview.130.36+326)
-> compiled  ppx_base.v0.18~preview.130.36+326
-> installed ppx_base.v0.18~preview.130.36+326
Processing 166/267: [base: dune build]
+ /home/opam/.opam/opam-init/hooks/sandbox.sh "build" "dune" "build" "-p" "base" "-j" "255" (CWD=/home/opam/.opam/5.2.0+flambda2/.opam-switch/build/base.v0.18~preview.130.36+326)
- (cd _build/default && /home/opam/.opam/5.2.0+flambda2/bin/ocamlc.opt -w -40 -g -bin-annot -bin-annot-occurrences -I src/.base.objs/byte -I /home/opam/.opam/5.2.0+flambda2/lib/basement -I /home/opam/.opam/5.2.0+flambda2/lib/ocaml_intrinsics_kernel -I /home/opam/.opam/5.2.0+flambda2/lib/ppx_compare/runtime-lib -I /home/opam/.opam/5.2.0+flambda2/lib/ppx_enumerate/runtime-lib -I /home/opam/.opam/5.2.0+flambda2/lib/ppx_hash/base_internalhash_types -I /home/opam/.opam/5.2.0+flambda2/lib/ppx_hash/runtime-lib -I /home/opam/.opam/5.2.0+flambda2/lib/ppx_sexp_conv/runtime-lib -I /home/opam/.opam/5.2.0+flambda2/lib/sexplib0 -I shadow-stdlib/src/.shadow_stdlib.objs/byte -intf-suffix .ml -no-alias-deps -open Base__ -o src/.base.objs/byte/base__Modes.cmo -c -impl src/modes.pp.ml)
- File "src/modes.ml", lines 398-402, characters 2-78:
- 398 | ..type local =
- 399 |     [ `global
- 400 |     | `local of (actually_local[@compare.ignore] [@equal.ignore] [@sexp.opaque])
- 401 |     ]
- 402 |   [@@deriving compare ~localize, equal ~localize, hash, sexp_of, sexp_grammar]
- Warning 56 [unreachable-case]: this match case is unreachable.
- Consider replacing it with a refutation case '<pat> -> .'
- 
- File "src/modes.ml", lines 398-402, characters 2-78:
- 398 | ..type local =
- 399 |     [ `global
- 400 |     | `local of (actually_local[@compare.ignore] [@equal.ignore] [@sexp.opaque])
- 401 |     ]
- 402 |   [@@deriving compare ~localize, equal ~localize, hash, sexp_of, sexp_grammar]
- Warning 56 [unreachable-case]: this match case is unreachable.
- Consider replacing it with a refutation case '<pat> -> .'
- 
- File "src/modes.ml", lines 398-402, characters 2-78:
- 398 | ..type local =
- 399 |     [ `global
- 400 |     | `local of (actually_local[@compare.ignore] [@equal.ignore] [@sexp.opaque])
- 401 |     ]
- 402 |   [@@deriving compare ~localize, equal ~localize, hash, sexp_of, sexp_grammar]
- Warning 56 [unreachable-case]: this match case is unreachable.
- Consider replacing it with a refutation case '<pat> -> .'
- 
- File "src/modes.ml", lines 399-401, characters 4-5:
- 399 | ....[ `global
- 400 |     | `local of (actually_local[@compare.ignore] [@equal.ignore] [@sexp.opaque])
- 401 |     ]
- Warning 56 [unreachable-case]: this match case is unreachable.
- Consider replacing it with a refutation case '<pat> -> .'
- (cd _build/default && /home/opam/.opam/5.2.0+flambda2/bin/ocamlopt.opt -w -40 -g -O3 -flambda2-inline-max-depth 10 -I src/.base.objs/byte -I src/.base.objs/native -I /home/opam/.opam/5.2.0+flambda2/lib/basement -I /home/opam/.opam/5.2.0+flambda2/lib/ocaml_intrinsics_kernel -I /home/opam/.opam/5.2.0+flambda2/lib/ppx_compare/runtime-lib -I /home/opam/.opam/5.2.0+flambda2/lib/ppx_enumerate/runtime-lib -I /home/opam/.opam/5.2.0+flambda2/lib/ppx_hash/base_internalhash_types -I /home/opam/.opam/5.2.0+flambda2/lib/ppx_hash/runtime-lib -I /home/opam/.opam/5.2.0+flambda2/lib/ppx_sexp_conv/runtime-lib -I /home/opam/.opam/5.2.0+flambda2/lib/sexplib0 -I shadow-stdlib/src/.shadow_stdlib.objs/byte -I shadow-stdlib/src/.shadow_stdlib.objs/native -intf-suffix .ml -no-alias-deps -open Base__ -o src/.base.objs/native/base__Modes.cmx -c -impl src/modes.pp.ml)
- File "src/modes.ml", lines 398-402, characters 2-78:
- 398 | ..type local =
- 399 |     [ `global
- 400 |     | `local of (actually_local[@compare.ignore] [@equal.ignore] [@sexp.opaque])
- 401 |     ]
- 402 |   [@@deriving compare ~localize, equal ~localize, hash, sexp_of, sexp_grammar]
- Warning 56 [unreachable-case]: this match case is unreachable.
- Consider replacing it with a refutation case '<pat> -> .'
- 
- File "src/modes.ml", lines 398-402, characters 2-78:
- 398 | ..type local =
- 399 |     [ `global
- 400 |     | `local of (actually_local[@compare.ignore] [@equal.ignore] [@sexp.opaque])
- 401 |     ]
- 402 |   [@@deriving compare ~localize, equal ~localize, hash, sexp_of, sexp_grammar]
- Warning 56 [unreachable-case]: this match case is unreachable.
- Consider replacing it with a refutation case '<pat> -> .'
- 
- File "src/modes.ml", lines 398-402, characters 2-78:
- 398 | ..type local =
- 399 |     [ `global
- 400 |     | `local of (actually_local[@compare.ignore] [@equal.ignore] [@sexp.opaque])
- 401 |     ]
- 402 |   [@@deriving compare ~localize, equal ~localize, hash, sexp_of, sexp_grammar]
- Warning 56 [unreachable-case]: this match case is unreachable.
- Consider replacing it with a refutation case '<pat> -> .'
- 
- File "src/modes.ml", lines 399-401, characters 4-5:
- 399 | ....[ `global
- 400 |     | `local of (actually_local[@compare.ignore] [@equal.ignore] [@sexp.opaque])
- 401 |     ]
- Warning 56 [unreachable-case]: this match case is unreachable.
- Consider replacing it with a refutation case '<pat> -> .'
-> compiled  base.v0.18~preview.130.36+326
-> installed base.v0.18~preview.130.36+326
Processing 168/267: [capitalization: dune build]
Processing 169/267: [capitalization: dune build] [fieldslib: dune build]
Processing 170/267: [capitalization: dune build] [fieldslib: dune build] [ppx_custom_printf: dune build]
Processing 171/267: [capitalization: dune build] [fieldslib: dune build] [ppx_custom_printf: dune build] [ppx_disable_unused_warnings: dune build]
Processing 172/267: [capitalization: dune build] [fieldslib: dune build] [ppx_custom_printf: dune build] [ppx_disable_unused_warnings: dune build] [ppx_fixed_literal: dune build]
Processing 173/267: [capitalization: dune build] [fieldslib: dune build] [ppx_custom_printf: dune build] [ppx_disable_unused_warnings: dune build] [ppx_fixed_literal: dune build] [ppx_here: dune build]
Processing 174/267: [capitalization: dune build] [fieldslib: dune build] [ppx_custom_printf: dune build] [ppx_disable_unused_warnings: dune build] [ppx_fixed_literal: dune build] [ppx_here: dune build] [ppx_optional: dune build]
Processing 175/267: [capitalization: dune build] [fieldslib: dune build] [ppx_custom_printf: dune build] [ppx_disable_unused_warnings: dune build] [ppx_fixed_literal: dune build] [ppx_here: dune build] [ppx_optional: dune build] [ppx_stable: dune build]
Processing 176/267: [capitalization: dune build] [fieldslib: dune build] [ppx_custom_printf: dune build] [ppx_disable_unused_warnings: dune build] [ppx_fixed_literal: dune build] [ppx_here: dune build] [ppx_optional: dune build] [ppx_stable: dune build] [ppx_stable_witness: dune build]
Processing 177/267: [capitalization: dune build] [fieldslib: dune build] [ppx_custom_printf: dune build] [ppx_disable_unused_warnings: dune build] [ppx_fixed_literal: dune build] [ppx_here: dune build] [ppx_optional: dune build] [ppx_stable: dune build] [ppx_stable_witness: dune build] [ppx_string: dune build]
Processing 178/267: [capitalization: dune build] [fieldslib: dune build] [ppx_custom_printf: dune build] [ppx_disable_unused_warnings: dune build] [ppx_fixed_literal: dune build] [ppx_here: dune build] [ppx_optional: dune build] [ppx_stable: dune build] [ppx_stable_witness: dune build] [ppx_string: dune build] [ppx_tydi: dune build]
Processing 179/267: [capitalization: dune build] [fieldslib: dune build] [ppx_custom_printf: dune build] [ppx_disable_unused_warnings: dune build] [ppx_fixed_literal: dune build] [ppx_here: dune build] [ppx_optional: dune build] [ppx_stable: dune build] [ppx_stable_witness: dune build] [ppx_string: dune build] [ppx_tydi: dune build] [ppx_var_name: dune build]
Processing 180/267: [capitalization: dune build] [fieldslib: dune build] [ppx_custom_printf: dune build] [ppx_disable_unused_warnings: dune build] [ppx_fixed_literal: dune build] [ppx_here: dune build] [ppx_optional: dune build] [ppx_stable: dune build] [ppx_stable_witness: dune build] [ppx_string: dune build] [ppx_tydi: dune build] [ppx_var_name: dune build] [sexp_pretty: dune build]
Processing 181/267: [capitalization: dune build] [fieldslib: dune build] [ppx_custom_printf: dune build] [ppx_disable_unused_warnings: dune build] [ppx_fixed_literal: dune build] [ppx_here: dune build] [ppx_optional: dune build] [ppx_stable: dune build] [ppx_stable_witness: dune build] [ppx_string: dune build] [ppx_tydi: dune build] [ppx_var_name: dune build] [sexp_pretty: dune build] [stdio: dune build]
Processing 182/267: [capitalization: dune build] [fieldslib: dune build] [ppx_custom_printf: dune build] [ppx_disable_unused_warnings: dune build] [ppx_fixed_literal: dune build] [ppx_here: dune build] [ppx_optional: dune build] [ppx_stable: dune build] [ppx_stable_witness: dune build] [ppx_string: dune build] [ppx_tydi: dune build] [ppx_var_name: dune build] [sexp_pretty: dune build] [stdio: dune build] [string_dict: dune build]
Processing 183/267: [capitalization: dune build] [fieldslib: dune build] [ppx_custom_printf: dune build] [ppx_disable_unused_warnings: dune build] [ppx_fixed_literal: dune build] [ppx_here: dune build] [ppx_optional: dune build] [ppx_stable: dune build] [ppx_stable_witness: dune build] [ppx_string: dune build] [ppx_tydi: dune build] [ppx_var_name: dune build] [sexp_pretty: dune build] [stdio: dune build] [string_dict: dune build] [typerep: dune build]
Processing 184/267: [capitalization: dune build] [fieldslib: dune build] [ppx_custom_printf: dune build] [ppx_disable_unused_warnings: dune build] [ppx_fixed_literal: dune build] [ppx_here: dune build] [ppx_optional: dune build] [ppx_stable: dune build] [ppx_stable_witness: dune build] [ppx_string: dune build] [ppx_tydi: dune build] [ppx_var_name: dune build] [sexp_pretty: dune build] [stdio: dune build] [string_dict: dune build] [typerep: dune build] [variantslib: dune build]
+ /home/opam/.opam/opam-init/hooks/sandbox.sh "build" "dune" "build" "-p" "fieldslib" "-j" "255" (CWD=/home/opam/.opam/5.2.0+flambda2/.opam-switch/build/fieldslib.v0.18~preview.130.36+326)
-> compiled  fieldslib.v0.18~preview.130.36+326
Processing 184/267: [capitalization: dune build] [ppx_custom_printf: dune build] [ppx_disable_unused_warnings: dune build] [ppx_fixed_literal: dune build] [ppx_here: dune build] [ppx_optional: dune build] [ppx_stable: dune build] [ppx_stable_witness: dune build] [ppx_string: dune build] [ppx_tydi: dune build] [ppx_var_name: dune build] [sexp_pretty: dune build] [stdio: dune build] [string_dict: dune build] [typerep: dune build] [variantslib: dune build]
-> installed fieldslib.v0.18~preview.130.36+326
Processing 185/267: [capitalization: dune build] [ppx_custom_printf: dune build] [ppx_disable_unused_warnings: dune build] [ppx_fixed_literal: dune build] [ppx_here: dune build] [ppx_optional: dune build] [ppx_stable: dune build] [ppx_stable_witness: dune build] [ppx_string: dune build] [ppx_tydi: dune build] [ppx_var_name: dune build] [sexp_pretty: dune build] [stdio: dune build] [string_dict: dune build] [typerep: dune build] [variantslib: dune build]
Processing 186/267: [capitalization: dune build] [ppx_custom_printf: dune build] [ppx_disable_unused_warnings: dune build] [ppx_fields_conv: dune build] [ppx_fixed_literal: dune build] [ppx_here: dune build] [ppx_optional: dune build] [ppx_stable: dune build] [ppx_stable_witness: dune build] [ppx_string: dune build] [ppx_tydi: dune build] [ppx_var_name: dune build] [sexp_pretty: dune build] [stdio: dune build] [string_dict: dune build] [typerep: dune build] [variantslib: dune build]
+ /home/opam/.opam/opam-init/hooks/sandbox.sh "build" "dune" "build" "-p" "variantslib" "-j" "255" (CWD=/home/opam/.opam/5.2.0+flambda2/.opam-switch/build/variantslib.v0.18~preview.130.36+326)
-> compiled  variantslib.v0.18~preview.130.36+326
Processing 186/267: [capitalization: dune build] [ppx_custom_printf: dune build] [ppx_disable_unused_warnings: dune build] [ppx_fields_conv: dune build] [ppx_fixed_literal: dune build] [ppx_here: dune build] [ppx_optional: dune build] [ppx_stable: dune build] [ppx_stable_witness: dune build] [ppx_string: dune build] [ppx_tydi: dune build] [ppx_var_name: dune build] [sexp_pretty: dune build] [stdio: dune build] [string_dict: dune build] [typerep: dune build]
-> installed variantslib.v0.18~preview.130.36+326
Processing 187/267: [capitalization: dune build] [ppx_custom_printf: dune build] [ppx_disable_unused_warnings: dune build] [ppx_fields_conv: dune build] [ppx_fixed_literal: dune build] [ppx_here: dune build] [ppx_optional: dune build] [ppx_stable: dune build] [ppx_stable_witness: dune build] [ppx_string: dune build] [ppx_tydi: dune build] [ppx_var_name: dune build] [sexp_pretty: dune build] [stdio: dune build] [string_dict: dune build] [typerep: dune build]
Processing 188/267: [capitalization: dune build] [ppx_custom_printf: dune build] [ppx_disable_unused_warnings: dune build] [ppx_fields_conv: dune build] [ppx_fixed_literal: dune build] [ppx_here: dune build] [ppx_optional: dune build] [ppx_stable: dune build] [ppx_stable_witness: dune build] [ppx_string: dune build] [ppx_tydi: dune build] [ppx_var_name: dune build] [ppx_variants_conv: dune build] [sexp_pretty: dune build] [stdio: dune build] [string_dict: dune build] [typerep: dune build]
+ /home/opam/.opam/opam-init/hooks/sandbox.sh "build" "dune" "build" "-p" "stdio" "-j" "255" (CWD=/home/opam/.opam/5.2.0+flambda2/.opam-switch/build/stdio.v0.18~preview.130.36+326)
-> compiled  stdio.v0.18~preview.130.36+326
Processing 188/267: [capitalization: dune build] [ppx_custom_printf: dune build] [ppx_disable_unused_warnings: dune build] [ppx_fields_conv: dune build] [ppx_fixed_literal: dune build] [ppx_here: dune build] [ppx_optional: dune build] [ppx_stable: dune build] [ppx_stable_witness: dune build] [ppx_string: dune build] [ppx_tydi: dune build] [ppx_var_name: dune build] [ppx_variants_conv: dune build] [sexp_pretty: dune build] [string_dict: dune build] [typerep: dune build]
-> installed stdio.v0.18~preview.130.36+326
Processing 189/267: [capitalization: dune build] [ppx_custom_printf: dune build] [ppx_disable_unused_warnings: dune build] [ppx_fields_conv: dune build] [ppx_fixed_literal: dune build] [ppx_here: dune build] [ppx_optional: dune build] [ppx_stable: dune build] [ppx_stable_witness: dune build] [ppx_string: dune build] [ppx_tydi: dune build] [ppx_var_name: dune build] [ppx_variants_conv: dune build] [sexp_pretty: dune build] [string_dict: dune build] [typerep: dune build]
Processing 190/267: [capitalization: dune build] [ppx_custom_printf: dune build] [ppx_disable_unused_warnings: dune build] [ppx_fields_conv: dune build] [ppx_fixed_literal: dune build] [ppx_here: dune build] [ppx_optcomp: dune build] [ppx_optional: dune build] [ppx_stable: dune build] [ppx_stable_witness: dune build] [ppx_string: dune build] [ppx_tydi: dune build] [ppx_var_name: dune build] [ppx_variants_conv: dune build] [sexp_pretty: dune build] [string_dict: dune build] [typerep: dune build]
+ /home/opam/.opam/opam-init/hooks/sandbox.sh "build" "dune" "build" "-p" "capitalization" "-j" "255" (CWD=/home/opam/.opam/5.2.0+flambda2/.opam-switch/build/capitalization.v0.18~preview.130.36+326)
-> compiled  capitalization.v0.18~preview.130.36+326
Processing 190/267: [ppx_custom_printf: dune build] [ppx_disable_unused_warnings: dune build] [ppx_fields_conv: dune build] [ppx_fixed_literal: dune build] [ppx_here: dune build] [ppx_optcomp: dune build] [ppx_optional: dune build] [ppx_stable: dune build] [ppx_stable_witness: dune build] [ppx_string: dune build] [ppx_tydi: dune build] [ppx_var_name: dune build] [ppx_variants_conv: dune build] [sexp_pretty: dune build] [string_dict: dune build] [typerep: dune build]
-> installed capitalization.v0.18~preview.130.36+326
Processing 191/267: [ppx_custom_printf: dune build] [ppx_disable_unused_warnings: dune build] [ppx_fields_conv: dune build] [ppx_fixed_literal: dune build] [ppx_here: dune build] [ppx_optcomp: dune build] [ppx_optional: dune build] [ppx_stable: dune build] [ppx_stable_witness: dune build] [ppx_string: dune build] [ppx_tydi: dune build] [ppx_var_name: dune build] [ppx_variants_conv: dune build] [sexp_pretty: dune build] [string_dict: dune build] [typerep: dune build]
+ /home/opam/.opam/opam-init/hooks/sandbox.sh "build" "dune" "build" "-p" "ppx_optcomp" "-j" "255" (CWD=/home/opam/.opam/5.2.0+flambda2/.opam-switch/build/ppx_optcomp.v0.18~preview.130.36+326)
-> compiled  ppx_optcomp.v0.18~preview.130.36+326
Processing 191/267: [ppx_custom_printf: dune build] [ppx_disable_unused_warnings: dune build] [ppx_fields_conv: dune build] [ppx_fixed_literal: dune build] [ppx_here: dune build] [ppx_optional: dune build] [ppx_stable: dune build] [ppx_stable_witness: dune build] [ppx_string: dune build] [ppx_tydi: dune build] [ppx_var_name: dune build] [ppx_variants_conv: dune build] [sexp_pretty: dune build] [string_dict: dune build] [typerep: dune build]
-> installed ppx_optcomp.v0.18~preview.130.36+326
Processing 192/267: [ppx_custom_printf: dune build] [ppx_disable_unused_warnings: dune build] [ppx_fields_conv: dune build] [ppx_fixed_literal: dune build] [ppx_here: dune build] [ppx_optional: dune build] [ppx_stable: dune build] [ppx_stable_witness: dune build] [ppx_string: dune build] [ppx_tydi: dune build] [ppx_var_name: dune build] [ppx_variants_conv: dune build] [sexp_pretty: dune build] [string_dict: dune build] [typerep: dune build]
+ /home/opam/.opam/opam-init/hooks/sandbox.sh "build" "dune" "build" "-p" "ppx_tydi" "-j" "255" (CWD=/home/opam/.opam/5.2.0+flambda2/.opam-switch/build/ppx_tydi.v0.18~preview.130.36+326)
-> compiled  ppx_tydi.v0.18~preview.130.36+326
Processing 192/267: [ppx_custom_printf: dune build] [ppx_disable_unused_warnings: dune build] [ppx_fields_conv: dune build] [ppx_fixed_literal: dune build] [ppx_here: dune build] [ppx_optional: dune build] [ppx_stable: dune build] [ppx_stable_witness: dune build] [ppx_string: dune build] [ppx_var_name: dune build] [ppx_variants_conv: dune build] [sexp_pretty: dune build] [string_dict: dune build] [typerep: dune build]
-> installed ppx_tydi.v0.18~preview.130.36+326
Processing 193/267: [ppx_custom_printf: dune build] [ppx_disable_unused_warnings: dune build] [ppx_fields_conv: dune build] [ppx_fixed_literal: dune build] [ppx_here: dune build] [ppx_optional: dune build] [ppx_stable: dune build] [ppx_stable_witness: dune build] [ppx_string: dune build] [ppx_var_name: dune build] [ppx_variants_conv: dune build] [sexp_pretty: dune build] [string_dict: dune build] [typerep: dune build]
+ /home/opam/.opam/opam-init/hooks/sandbox.sh "build" "dune" "build" "-p" "ppx_disable_unused_warnings" "-j" "255" (CWD=/home/opam/.opam/5.2.0+flambda2/.opam-switch/build/ppx_disable_unused_warnings.v0.18~preview.130.36+326)
-> compiled  ppx_disable_unused_warnings.v0.18~preview.130.36+326
Processing 193/267: [ppx_custom_printf: dune build] [ppx_fields_conv: dune build] [ppx_fixed_literal: dune build] [ppx_here: dune build] [ppx_optional: dune build] [ppx_stable: dune build] [ppx_stable_witness: dune build] [ppx_string: dune build] [ppx_var_name: dune build] [ppx_variants_conv: dune build] [sexp_pretty: dune build] [string_dict: dune build] [typerep: dune build]
-> installed ppx_disable_unused_warnings.v0.18~preview.130.36+326
Processing 194/267: [ppx_custom_printf: dune build] [ppx_fields_conv: dune build] [ppx_fixed_literal: dune build] [ppx_here: dune build] [ppx_optional: dune build] [ppx_stable: dune build] [ppx_stable_witness: dune build] [ppx_string: dune build] [ppx_var_name: dune build] [ppx_variants_conv: dune build] [sexp_pretty: dune build] [string_dict: dune build] [typerep: dune build]
+ /home/opam/.opam/opam-init/hooks/sandbox.sh "build" "dune" "build" "-p" "ppx_here" "-j" "255" (CWD=/home/opam/.opam/5.2.0+flambda2/.opam-switch/build/ppx_here.v0.18~preview.130.36+326)
-> compiled  ppx_here.v0.18~preview.130.36+326
Processing 194/267: [ppx_custom_printf: dune build] [ppx_fields_conv: dune build] [ppx_fixed_literal: dune build] [ppx_optional: dune build] [ppx_stable: dune build] [ppx_stable_witness: dune build] [ppx_string: dune build] [ppx_var_name: dune build] [ppx_variants_conv: dune build] [sexp_pretty: dune build] [string_dict: dune build] [typerep: dune build]
-> installed ppx_here.v0.18~preview.130.36+326
Processing 195/267: [ppx_custom_printf: dune build] [ppx_fields_conv: dune build] [ppx_fixed_literal: dune build] [ppx_optional: dune build] [ppx_stable: dune build] [ppx_stable_witness: dune build] [ppx_string: dune build] [ppx_var_name: dune build] [ppx_variants_conv: dune build] [sexp_pretty: dune build] [string_dict: dune build] [typerep: dune build]
Processing 196/267: [ppx_assert: dune build] [ppx_custom_printf: dune build] [ppx_fields_conv: dune build] [ppx_fixed_literal: dune build] [ppx_optional: dune build] [ppx_stable: dune build] [ppx_stable_witness: dune build] [ppx_string: dune build] [ppx_var_name: dune build] [ppx_variants_conv: dune build] [sexp_pretty: dune build] [string_dict: dune build] [typerep: dune build]
Processing 197/267: [ppx_assert: dune build] [ppx_custom_printf: dune build] [ppx_fields_conv: dune build] [ppx_fixed_literal: dune build] [ppx_let: dune build] [ppx_optional: dune build] [ppx_stable: dune build] [ppx_stable_witness: dune build] [ppx_string: dune build] [ppx_var_name: dune build] [ppx_variants_conv: dune build] [sexp_pretty: dune build] [string_dict: dune build] [typerep: dune build]
Processing 198/267: [ppx_assert: dune build] [ppx_custom_printf: dune build] [ppx_fields_conv: dune build] [ppx_fixed_literal: dune build] [ppx_let: dune build] [ppx_optional: dune build] [ppx_sexp_message: dune build] [ppx_stable: dune build] [ppx_stable_witness: dune build] [ppx_string: dune build] [ppx_var_name: dune build] [ppx_variants_conv: dune build] [sexp_pretty: dune build] [string_dict: dune build] [typerep: dune build]
Processing 199/267: [ppx_assert: dune build] [ppx_custom_printf: dune build] [ppx_fields_conv: dune build] [ppx_fixed_literal: dune build] [ppx_let: dune build] [ppx_optional: dune build] [ppx_sexp_message: dune build] [ppx_sexp_value: dune build] [ppx_stable: dune build] [ppx_stable_witness: dune build] [ppx_string: dune build] [ppx_var_name: dune build] [ppx_variants_conv: dune build] [sexp_pretty: dune build] [string_dict: dune build] [typerep: dune build]
+ /home/opam/.opam/opam-init/hooks/sandbox.sh "build" "dune" "build" "-p" "ppx_stable_witness" "-j" "255" (CWD=/home/opam/.opam/5.2.0+flambda2/.opam-switch/build/ppx_stable_witness.v0.18~preview.130.36+326)
-> compiled  ppx_stable_witness.v0.18~preview.130.36+326
Processing 199/267: [ppx_assert: dune build] [ppx_custom_printf: dune build] [ppx_fields_conv: dune build] [ppx_fixed_literal: dune build] [ppx_let: dune build] [ppx_optional: dune build] [ppx_sexp_message: dune build] [ppx_sexp_value: dune build] [ppx_stable: dune build] [ppx_string: dune build] [ppx_var_name: dune build] [ppx_variants_conv: dune build] [sexp_pretty: dune build] [string_dict: dune build] [typerep: dune build]
-> installed ppx_stable_witness.v0.18~preview.130.36+326
Processing 200/267: [ppx_assert: dune build] [ppx_custom_printf: dune build] [ppx_fields_conv: dune build] [ppx_fixed_literal: dune build] [ppx_let: dune build] [ppx_optional: dune build] [ppx_sexp_message: dune build] [ppx_sexp_value: dune build] [ppx_stable: dune build] [ppx_string: dune build] [ppx_var_name: dune build] [ppx_variants_conv: dune build] [sexp_pretty: dune build] [string_dict: dune build] [typerep: dune build]
+ /home/opam/.opam/opam-init/hooks/sandbox.sh "build" "dune" "build" "-p" "ppx_var_name" "-j" "255" (CWD=/home/opam/.opam/5.2.0+flambda2/.opam-switch/build/ppx_var_name.v0.18~preview.130.36+326)
-> compiled  ppx_var_name.v0.18~preview.130.36+326
Processing 200/267: [ppx_assert: dune build] [ppx_custom_printf: dune build] [ppx_fields_conv: dune build] [ppx_fixed_literal: dune build] [ppx_let: dune build] [ppx_optional: dune build] [ppx_sexp_message: dune build] [ppx_sexp_value: dune build] [ppx_stable: dune build] [ppx_string: dune build] [ppx_variants_conv: dune build] [sexp_pretty: dune build] [string_dict: dune build] [typerep: dune build]
-> installed ppx_var_name.v0.18~preview.130.36+326
Processing 201/267: [ppx_assert: dune build] [ppx_custom_printf: dune build] [ppx_fields_conv: dune build] [ppx_fixed_literal: dune build] [ppx_let: dune build] [ppx_optional: dune build] [ppx_sexp_message: dune build] [ppx_sexp_value: dune build] [ppx_stable: dune build] [ppx_string: dune build] [ppx_variants_conv: dune build] [sexp_pretty: dune build] [string_dict: dune build] [typerep: dune build]
+ /home/opam/.opam/opam-init/hooks/sandbox.sh "build" "dune" "build" "-p" "string_dict" "-j" "255" (CWD=/home/opam/.opam/5.2.0+flambda2/.opam-switch/build/string_dict.v0.18~preview.130.36+326)
-> compiled  string_dict.v0.18~preview.130.36+326
Processing 201/267: [ppx_assert: dune build] [ppx_custom_printf: dune build] [ppx_fields_conv: dune build] [ppx_fixed_literal: dune build] [ppx_let: dune build] [ppx_optional: dune build] [ppx_sexp_message: dune build] [ppx_sexp_value: dune build] [ppx_stable: dune build] [ppx_string: dune build] [ppx_variants_conv: dune build] [sexp_pretty: dune build] [typerep: dune build]
-> installed string_dict.v0.18~preview.130.36+326
Processing 202/267: [ppx_assert: dune build] [ppx_custom_printf: dune build] [ppx_fields_conv: dune build] [ppx_fixed_literal: dune build] [ppx_let: dune build] [ppx_optional: dune build] [ppx_sexp_message: dune build] [ppx_sexp_value: dune build] [ppx_stable: dune build] [ppx_string: dune build] [ppx_variants_conv: dune build] [sexp_pretty: dune build] [typerep: dune build]
+ /home/opam/.opam/opam-init/hooks/sandbox.sh "build" "dune" "build" "-p" "typerep" "-j" "255" (CWD=/home/opam/.opam/5.2.0+flambda2/.opam-switch/build/typerep.v0.18~preview.130.36+326)
-> compiled  typerep.v0.18~preview.130.36+326
Processing 202/267: [ppx_assert: dune build] [ppx_custom_printf: dune build] [ppx_fields_conv: dune build] [ppx_fixed_literal: dune build] [ppx_let: dune build] [ppx_optional: dune build] [ppx_sexp_message: dune build] [ppx_sexp_value: dune build] [ppx_stable: dune build] [ppx_string: dune build] [ppx_variants_conv: dune build] [sexp_pretty: dune build]
-> installed typerep.v0.18~preview.130.36+326
Processing 203/267: [ppx_assert: dune build] [ppx_custom_printf: dune build] [ppx_fields_conv: dune build] [ppx_fixed_literal: dune build] [ppx_let: dune build] [ppx_optional: dune build] [ppx_sexp_message: dune build] [ppx_sexp_value: dune build] [ppx_stable: dune build] [ppx_string: dune build] [ppx_variants_conv: dune build] [sexp_pretty: dune build]
Processing 204/267: [ppx_assert: dune build] [ppx_custom_printf: dune build] [ppx_fields_conv: dune build] [ppx_fixed_literal: dune build] [ppx_let: dune build] [ppx_optional: dune build] [ppx_sexp_message: dune build] [ppx_sexp_value: dune build] [ppx_stable: dune build] [ppx_string: dune build] [ppx_typerep_conv: dune build] [ppx_variants_conv: dune build] [sexp_pretty: dune build]
+ /home/opam/.opam/opam-init/hooks/sandbox.sh "build" "dune" "build" "-p" "sexp_pretty" "-j" "255" (CWD=/home/opam/.opam/5.2.0+flambda2/.opam-switch/build/sexp_pretty.v0.18~preview.130.36+326)
-> compiled  sexp_pretty.v0.18~preview.130.36+326
Processing 204/267: [ppx_assert: dune build] [ppx_custom_printf: dune build] [ppx_fields_conv: dune build] [ppx_fixed_literal: dune build] [ppx_let: dune build] [ppx_optional: dune build] [ppx_sexp_message: dune build] [ppx_sexp_value: dune build] [ppx_stable: dune build] [ppx_string: dune build] [ppx_typerep_conv: dune build] [ppx_variants_conv: dune build]
-> installed sexp_pretty.v0.18~preview.130.36+326
Processing 205/267: [ppx_assert: dune build] [ppx_custom_printf: dune build] [ppx_fields_conv: dune build] [ppx_fixed_literal: dune build] [ppx_let: dune build] [ppx_optional: dune build] [ppx_sexp_message: dune build] [ppx_sexp_value: dune build] [ppx_stable: dune build] [ppx_string: dune build] [ppx_typerep_conv: dune build] [ppx_variants_conv: dune build]
+ /home/opam/.opam/opam-init/hooks/sandbox.sh "build" "dune" "build" "-p" "ppx_fixed_literal" "-j" "255" (CWD=/home/opam/.opam/5.2.0+flambda2/.opam-switch/build/ppx_fixed_literal.v0.18~preview.130.36+326)
-> compiled  ppx_fixed_literal.v0.18~preview.130.36+326
Processing 205/267: [ppx_assert: dune build] [ppx_custom_printf: dune build] [ppx_fields_conv: dune build] [ppx_let: dune build] [ppx_optional: dune build] [ppx_sexp_message: dune build] [ppx_sexp_value: dune build] [ppx_stable: dune build] [ppx_string: dune build] [ppx_typerep_conv: dune build] [ppx_variants_conv: dune build]
-> installed ppx_fixed_literal.v0.18~preview.130.36+326
Processing 206/267: [ppx_assert: dune build] [ppx_custom_printf: dune build] [ppx_fields_conv: dune build] [ppx_let: dune build] [ppx_optional: dune build] [ppx_sexp_message: dune build] [ppx_sexp_value: dune build] [ppx_stable: dune build] [ppx_string: dune build] [ppx_typerep_conv: dune build] [ppx_variants_conv: dune build]
+ /home/opam/.opam/opam-init/hooks/sandbox.sh "build" "dune" "build" "-p" "ppx_stable" "-j" "255" (CWD=/home/opam/.opam/5.2.0+flambda2/.opam-switch/build/ppx_stable.v0.18~preview.130.36+326)
-> compiled  ppx_stable.v0.18~preview.130.36+326
Processing 206/267: [ppx_assert: dune build] [ppx_custom_printf: dune build] [ppx_fields_conv: dune build] [ppx_let: dune build] [ppx_optional: dune build] [ppx_sexp_message: dune build] [ppx_sexp_value: dune build] [ppx_string: dune build] [ppx_typerep_conv: dune build] [ppx_variants_conv: dune build]
-> installed ppx_stable.v0.18~preview.130.36+326
Processing 207/267: [ppx_assert: dune build] [ppx_custom_printf: dune build] [ppx_fields_conv: dune build] [ppx_let: dune build] [ppx_optional: dune build] [ppx_sexp_message: dune build] [ppx_sexp_value: dune build] [ppx_string: dune build] [ppx_typerep_conv: dune build] [ppx_variants_conv: dune build]
+ /home/opam/.opam/opam-init/hooks/sandbox.sh "build" "dune" "build" "-p" "ppx_variants_conv" "-j" "255" (CWD=/home/opam/.opam/5.2.0+flambda2/.opam-switch/build/ppx_variants_conv.v0.18~preview.130.36+326)
-> compiled  ppx_variants_conv.v0.18~preview.130.36+326
Processing 207/267: [ppx_assert: dune build] [ppx_custom_printf: dune build] [ppx_fields_conv: dune build] [ppx_let: dune build] [ppx_optional: dune build] [ppx_sexp_message: dune build] [ppx_sexp_value: dune build] [ppx_string: dune build] [ppx_typerep_conv: dune build]
-> installed ppx_variants_conv.v0.18~preview.130.36+326
Processing 208/267: [ppx_assert: dune build] [ppx_custom_printf: dune build] [ppx_fields_conv: dune build] [ppx_let: dune build] [ppx_optional: dune build] [ppx_sexp_message: dune build] [ppx_sexp_value: dune build] [ppx_string: dune build] [ppx_typerep_conv: dune build]
+ /home/opam/.opam/opam-init/hooks/sandbox.sh "build" "dune" "build" "-p" "ppx_optional" "-j" "255" (CWD=/home/opam/.opam/5.2.0+flambda2/.opam-switch/build/ppx_optional.v0.18~preview.130.36+326)
-> compiled  ppx_optional.v0.18~preview.130.36+326
Processing 208/267: [ppx_assert: dune build] [ppx_custom_printf: dune build] [ppx_fields_conv: dune build] [ppx_let: dune build] [ppx_sexp_message: dune build] [ppx_sexp_value: dune build] [ppx_string: dune build] [ppx_typerep_conv: dune build]
-> installed ppx_optional.v0.18~preview.130.36+326
Processing 209/267: [ppx_assert: dune build] [ppx_custom_printf: dune build] [ppx_fields_conv: dune build] [ppx_let: dune build] [ppx_sexp_message: dune build] [ppx_sexp_value: dune build] [ppx_string: dune build] [ppx_typerep_conv: dune build]
+ /home/opam/.opam/opam-init/hooks/sandbox.sh "build" "dune" "build" "-p" "ppx_string" "-j" "255" (CWD=/home/opam/.opam/5.2.0+flambda2/.opam-switch/build/ppx_string.v0.18~preview.130.36+326)
-> compiled  ppx_string.v0.18~preview.130.36+326
Processing 209/267: [ppx_assert: dune build] [ppx_custom_printf: dune build] [ppx_fields_conv: dune build] [ppx_let: dune build] [ppx_sexp_message: dune build] [ppx_sexp_value: dune build] [ppx_typerep_conv: dune build]
-> installed ppx_string.v0.18~preview.130.36+326
Processing 210/267: [ppx_assert: dune build] [ppx_custom_printf: dune build] [ppx_fields_conv: dune build] [ppx_let: dune build] [ppx_sexp_message: dune build] [ppx_sexp_value: dune build] [ppx_typerep_conv: dune build]
+ /home/opam/.opam/opam-init/hooks/sandbox.sh "build" "dune" "build" "-p" "ppx_fields_conv" "-j" "255" (CWD=/home/opam/.opam/5.2.0+flambda2/.opam-switch/build/ppx_fields_conv.v0.18~preview.130.36+326)
-> compiled  ppx_fields_conv.v0.18~preview.130.36+326
Processing 210/267: [ppx_assert: dune build] [ppx_custom_printf: dune build] [ppx_let: dune build] [ppx_sexp_message: dune build] [ppx_sexp_value: dune build] [ppx_typerep_conv: dune build]
-> installed ppx_fields_conv.v0.18~preview.130.36+326
Processing 211/267: [ppx_assert: dune build] [ppx_custom_printf: dune build] [ppx_let: dune build] [ppx_sexp_message: dune build] [ppx_sexp_value: dune build] [ppx_typerep_conv: dune build]
+ /home/opam/.opam/opam-init/hooks/sandbox.sh "build" "dune" "build" "-p" "ppx_custom_printf" "-j" "255" (CWD=/home/opam/.opam/5.2.0+flambda2/.opam-switch/build/ppx_custom_printf.v0.18~preview.130.36+326)
-> compiled  ppx_custom_printf.v0.18~preview.130.36+326
Processing 211/267: [ppx_assert: dune build] [ppx_let: dune build] [ppx_sexp_message: dune build] [ppx_sexp_value: dune build] [ppx_typerep_conv: dune build]
-> installed ppx_custom_printf.v0.18~preview.130.36+326
Processing 212/267: [ppx_assert: dune build] [ppx_let: dune build] [ppx_sexp_message: dune build] [ppx_sexp_value: dune build] [ppx_typerep_conv: dune build]
Processing 213/267: [bin_prot: dune build] [ppx_assert: dune build] [ppx_let: dune build] [ppx_sexp_message: dune build] [ppx_sexp_value: dune build] [ppx_typerep_conv: dune build]
+ /home/opam/.opam/opam-init/hooks/sandbox.sh "build" "dune" "build" "-p" "ppx_typerep_conv" "-j" "255" (CWD=/home/opam/.opam/5.2.0+flambda2/.opam-switch/build/ppx_typerep_conv.v0.18~preview.130.36+326)
-> compiled  ppx_typerep_conv.v0.18~preview.130.36+326
Processing 213/267: [bin_prot: dune build] [ppx_assert: dune build] [ppx_let: dune build] [ppx_sexp_message: dune build] [ppx_sexp_value: dune build]
-> installed ppx_typerep_conv.v0.18~preview.130.36+326
Processing 214/267: [bin_prot: dune build] [ppx_assert: dune build] [ppx_let: dune build] [ppx_sexp_message: dune build] [ppx_sexp_value: dune build]
+ /home/opam/.opam/opam-init/hooks/sandbox.sh "build" "dune" "build" "-p" "ppx_assert" "-j" "255" (CWD=/home/opam/.opam/5.2.0+flambda2/.opam-switch/build/ppx_assert.v0.18~preview.130.36+326)
-> compiled  ppx_assert.v0.18~preview.130.36+326
Processing 214/267: [bin_prot: dune build] [ppx_let: dune build] [ppx_sexp_message: dune build] [ppx_sexp_value: dune build]
-> installed ppx_assert.v0.18~preview.130.36+326
Processing 215/267: [bin_prot: dune build] [ppx_let: dune build] [ppx_sexp_message: dune build] [ppx_sexp_value: dune build]
Processing 216/267: [bin_prot: dune build] [jst-config: dune build] [ppx_let: dune build] [ppx_sexp_message: dune build] [ppx_sexp_value: dune build]
+ /home/opam/.opam/opam-init/hooks/sandbox.sh "build" "dune" "build" "-p" "ppx_sexp_value" "-j" "255" (CWD=/home/opam/.opam/5.2.0+flambda2/.opam-switch/build/ppx_sexp_value.v0.18~preview.130.36+326)
-> compiled  ppx_sexp_value.v0.18~preview.130.36+326
Processing 216/267: [bin_prot: dune build] [jst-config: dune build] [ppx_let: dune build] [ppx_sexp_message: dune build]
-> installed ppx_sexp_value.v0.18~preview.130.36+326
Processing 217/267: [bin_prot: dune build] [jst-config: dune build] [ppx_let: dune build] [ppx_sexp_message: dune build]
+ /home/opam/.opam/opam-init/hooks/sandbox.sh "build" "dune" "build" "-p" "ppx_sexp_message" "-j" "255" (CWD=/home/opam/.opam/5.2.0+flambda2/.opam-switch/build/ppx_sexp_message.v0.18~preview.130.36+326)
-> compiled  ppx_sexp_message.v0.18~preview.130.36+326
Processing 217/267: [bin_prot: dune build] [jst-config: dune build] [ppx_let: dune build]
-> installed ppx_sexp_message.v0.18~preview.130.36+326
Processing 218/267: [bin_prot: dune build] [jst-config: dune build] [ppx_let: dune build]
+ /home/opam/.opam/opam-init/hooks/sandbox.sh "build" "dune" "build" "-p" "ppx_let" "-j" "255" (CWD=/home/opam/.opam/5.2.0+flambda2/.opam-switch/build/ppx_let.v0.18~preview.130.36+326)
-> compiled  ppx_let.v0.18~preview.130.36+326
Processing 218/267: [bin_prot: dune build] [jst-config: dune build]
-> installed ppx_let.v0.18~preview.130.36+326
Processing 219/267: [bin_prot: dune build] [jst-config: dune build]
Processing 220/267: [bin_prot: dune build] [jst-config: dune build] [ppx_string_conv: dune build]
+ /home/opam/.opam/opam-init/hooks/sandbox.sh "build" "dune" "build" "-p" "jst-config" "-j" "255" (CWD=/home/opam/.opam/5.2.0+flambda2/.opam-switch/build/jst-config.v0.18~preview.130.36+326)
-> compiled  jst-config.v0.18~preview.130.36+326
Processing 220/267: [bin_prot: dune build] [ppx_string_conv: dune build]
-> installed jst-config.v0.18~preview.130.36+326
Processing 221/267: [bin_prot: dune build] [ppx_string_conv: dune build]
Processing 222/267: [bin_prot: dune build] [ppx_string_conv: dune build] [time_now: dune build]
+ /home/opam/.opam/opam-init/hooks/sandbox.sh "build" "dune" "build" "-p" "bin_prot" "-j" "255" (CWD=/home/opam/.opam/5.2.0+flambda2/.opam-switch/build/bin_prot.v0.18~preview.130.36+326)
-> compiled  bin_prot.v0.18~preview.130.36+326
Processing 222/267: [ppx_string_conv: dune build] [time_now: dune build]
-> installed bin_prot.v0.18~preview.130.36+326
Processing 223/267: [ppx_string_conv: dune build] [time_now: dune build]
Processing 224/267: [ppx_bin_prot: dune build] [ppx_string_conv: dune build] [time_now: dune build]
+ /home/opam/.opam/opam-init/hooks/sandbox.sh "build" "dune" "build" "-p" "ppx_string_conv" "-j" "255" (CWD=/home/opam/.opam/5.2.0+flambda2/.opam-switch/build/ppx_string_conv.v0.18~preview.130.36+326)
-> compiled  ppx_string_conv.v0.18~preview.130.36+326
Processing 224/267: [ppx_bin_prot: dune build] [time_now: dune build]
-> installed ppx_string_conv.v0.18~preview.130.36+326
Processing 225/267: [ppx_bin_prot: dune build] [time_now: dune build]
+ /home/opam/.opam/opam-init/hooks/sandbox.sh "build" "dune" "build" "-p" "time_now" "-j" "255" (CWD=/home/opam/.opam/5.2.0+flambda2/.opam-switch/build/time_now.v0.18~preview.130.36+326)
-> compiled  time_now.v0.18~preview.130.36+326
Processing 225/267: [ppx_bin_prot: dune build]
-> installed time_now.v0.18~preview.130.36+326
Processing 226/267: [ppx_bin_prot: dune build]
Processing 227/267: [ppx_bin_prot: dune build] [ppx_inline_test: dune build]
Processing 228/267: [ppx_bin_prot: dune build] [ppx_inline_test: dune build] [ppx_module_timer: dune build]
+ /home/opam/.opam/opam-init/hooks/sandbox.sh "build" "dune" "build" "-p" "ppx_bin_prot" "-j" "255" (CWD=/home/opam/.opam/5.2.0+flambda2/.opam-switch/build/ppx_bin_prot.v0.18~preview.130.36+326)
-> compiled  ppx_bin_prot.v0.18~preview.130.36+326
Processing 228/267: [ppx_inline_test: dune build] [ppx_module_timer: dune build]
-> installed ppx_bin_prot.v0.18~preview.130.36+326
Processing 229/267: [ppx_inline_test: dune build] [ppx_module_timer: dune build]
+ /home/opam/.opam/opam-init/hooks/sandbox.sh "build" "dune" "build" "-p" "ppx_module_timer" "-j" "255" (CWD=/home/opam/.opam/5.2.0+flambda2/.opam-switch/build/ppx_module_timer.v0.18~preview.130.36+326)
-> compiled  ppx_module_timer.v0.18~preview.130.36+326
Processing 229/267: [ppx_inline_test: dune build]
-> installed ppx_module_timer.v0.18~preview.130.36+326
Processing 230/267: [ppx_inline_test: dune build]
+ /home/opam/.opam/opam-init/hooks/sandbox.sh "build" "dune" "build" "-p" "ppx_inline_test" "-j" "255" (CWD=/home/opam/.opam/5.2.0+flambda2/.opam-switch/build/ppx_inline_test.v0.18~preview.130.36+326)
-> compiled  ppx_inline_test.v0.18~preview.130.36+326
-> installed ppx_inline_test.v0.18~preview.130.36+326
Processing 232/267: [ppx_bench: dune build]
Processing 233/267: [ppx_bench: dune build] [ppx_expect: dune build]
Processing 234/267: [ppx_bench: dune build] [ppx_expect: dune build] [univ_map: dune build]
+ /home/opam/.opam/opam-init/hooks/sandbox.sh "build" "dune" "build" "-p" "univ_map" "-j" "255" (CWD=/home/opam/.opam/5.2.0+flambda2/.opam-switch/build/univ_map.v0.18~preview.130.36+326)
-> compiled  univ_map.v0.18~preview.130.36+326
Processing 234/267: [ppx_bench: dune build] [ppx_expect: dune build]
-> installed univ_map.v0.18~preview.130.36+326
Processing 235/267: [ppx_bench: dune build] [ppx_expect: dune build]
Processing 236/267: [ppx_bench: dune build] [ppx_expect: dune build] [ppx_typed_fields: dune build]
+ /home/opam/.opam/opam-init/hooks/sandbox.sh "build" "dune" "build" "-p" "ppx_bench" "-j" "255" (CWD=/home/opam/.opam/5.2.0+flambda2/.opam-switch/build/ppx_bench.v0.18~preview.130.36+326)
-> compiled  ppx_bench.v0.18~preview.130.36+326
Processing 236/267: [ppx_expect: dune build] [ppx_typed_fields: dune build]
-> installed ppx_bench.v0.18~preview.130.36+326
Processing 237/267: [ppx_expect: dune build] [ppx_typed_fields: dune build]
Processing 238/267: [ppx_expect: dune build] [ppx_typed_fields: dune build] [splittable_random: dune build]
+ /home/opam/.opam/opam-init/hooks/sandbox.sh "build" "dune" "build" "-p" "ppx_expect" "-j" "255" (CWD=/home/opam/.opam/5.2.0+flambda2/.opam-switch/build/ppx_expect.v0.18~preview.130.36+326)
-> compiled  ppx_expect.v0.18~preview.130.36+326
Processing 238/267: [ppx_typed_fields: dune build] [splittable_random: dune build]
-> installed ppx_expect.v0.18~preview.130.36+326
Processing 239/267: [ppx_typed_fields: dune build] [splittable_random: dune build]
Processing 240/267: [ppx_log: dune build] [ppx_typed_fields: dune build] [splittable_random: dune build]
+ /home/opam/.opam/opam-init/hooks/sandbox.sh "build" "dune" "build" "-p" "splittable_random" "-j" "255" (CWD=/home/opam/.opam/5.2.0+flambda2/.opam-switch/build/splittable_random.v0.18~preview.130.36+326)
-> compiled  splittable_random.v0.18~preview.130.36+326
Processing 240/267: [ppx_log: dune build] [ppx_typed_fields: dune build]
-> installed splittable_random.v0.18~preview.130.36+326
Processing 241/267: [ppx_log: dune build] [ppx_typed_fields: dune build]
Processing 242/267: [base_quickcheck: dune build] [ppx_log: dune build] [ppx_typed_fields: dune build]
+ /home/opam/.opam/opam-init/hooks/sandbox.sh "build" "dune" "build" "-p" "ppx_log" "-j" "255" (CWD=/home/opam/.opam/5.2.0+flambda2/.opam-switch/build/ppx_log.v0.18~preview.130.36+326)
-> compiled  ppx_log.v0.18~preview.130.36+326
Processing 242/267: [base_quickcheck: dune build] [ppx_typed_fields: dune build]
-> installed ppx_log.v0.18~preview.130.36+326
Processing 243/267: [base_quickcheck: dune build] [ppx_typed_fields: dune build]
+ /home/opam/.opam/opam-init/hooks/sandbox.sh "build" "dune" "build" "-p" "ppx_typed_fields" "-j" "255" (CWD=/home/opam/.opam/5.2.0+flambda2/.opam-switch/build/ppx_typed_fields.v0.18~preview.130.36+326)
-> compiled  ppx_typed_fields.v0.18~preview.130.36+326
Processing 243/267: [base_quickcheck: dune build]
-> installed ppx_typed_fields.v0.18~preview.130.36+326
Processing 244/267: [base_quickcheck: dune build]
+ /home/opam/.opam/opam-init/hooks/sandbox.sh "build" "dune" "build" "-p" "base_quickcheck" "-j" "255" (CWD=/home/opam/.opam/5.2.0+flambda2/.opam-switch/build/base_quickcheck.v0.18~preview.130.36+326)
-> compiled  base_quickcheck.v0.18~preview.130.36+326
-> installed base_quickcheck.v0.18~preview.130.36+326
Processing 246/267: [ppx_jane: dune build]
+ /home/opam/.opam/opam-init/hooks/sandbox.sh "build" "dune" "build" "-p" "ppx_jane" "-j" "255" (CWD=/home/opam/.opam/5.2.0+flambda2/.opam-switch/build/ppx_jane.v0.18~preview.130.36+326)
-> compiled  ppx_jane.v0.18~preview.130.36+326
-> installed ppx_jane.v0.18~preview.130.36+326
Processing 248/267: [int_repr: dune build]
Processing 249/267: [int_repr: dune build] [ppx_diff: dune build]
Processing 250/267: [int_repr: dune build] [ppx_diff: dune build] [uopt: dune build]
+ /home/opam/.opam/opam-init/hooks/sandbox.sh "build" "dune" "build" "-p" "uopt" "-j" "255" (CWD=/home/opam/.opam/5.2.0+flambda2/.opam-switch/build/uopt.v0.18~preview.130.36+326)
-> compiled  uopt.v0.18~preview.130.36+326
Processing 250/267: [int_repr: dune build] [ppx_diff: dune build]
-> installed uopt.v0.18~preview.130.36+326
Processing 251/267: [int_repr: dune build] [ppx_diff: dune build]
Processing 252/267: [int_repr: dune build] [portable: dune build] [ppx_diff: dune build]
+ /home/opam/.opam/opam-init/hooks/sandbox.sh "build" "dune" "build" "-p" "int_repr" "-j" "255" (CWD=/home/opam/.opam/5.2.0+flambda2/.opam-switch/build/int_repr.v0.18~preview.130.36+326)
-> compiled  int_repr.v0.18~preview.130.36+326
Processing 252/267: [portable: dune build] [ppx_diff: dune build]
-> installed int_repr.v0.18~preview.130.36+326
Processing 253/267: [portable: dune build] [ppx_diff: dune build]
Processing 254/267: [base_bigstring: dune build] [portable: dune build] [ppx_diff: dune build]
+ /home/opam/.opam/opam-init/hooks/sandbox.sh "build" "dune" "build" "-p" "portable" "-j" "255" (CWD=/home/opam/.opam/5.2.0+flambda2/.opam-switch/build/portable.v0.18~preview.130.36+326)
-> compiled  portable.v0.18~preview.130.36+326
Processing 254/267: [base_bigstring: dune build] [ppx_diff: dune build]
-> installed portable.v0.18~preview.130.36+326
Processing 255/267: [base_bigstring: dune build] [ppx_diff: dune build]
+ /home/opam/.opam/opam-init/hooks/sandbox.sh "build" "dune" "build" "-p" "base_bigstring" "-j" "255" (CWD=/home/opam/.opam/5.2.0+flambda2/.opam-switch/build/base_bigstring.v0.18~preview.130.36+326)
-> compiled  base_bigstring.v0.18~preview.130.36+326
Processing 255/267: [ppx_diff: dune build]
-> installed base_bigstring.v0.18~preview.130.36+326
Processing 256/267: [ppx_diff: dune build]
+ /home/opam/.opam/opam-init/hooks/sandbox.sh "build" "dune" "build" "-p" "ppx_diff" "-j" "255" (CWD=/home/opam/.opam/5.2.0+flambda2/.opam-switch/build/ppx_diff.v0.18~preview.130.36+326)
-> compiled  ppx_diff.v0.18~preview.130.36+326
-> installed ppx_diff.v0.18~preview.130.36+326
Processing 258/267: [core: dune build]
+ /home/opam/.opam/opam-init/hooks/sandbox.sh "build" "dune" "build" "-p" "core" "-j" "255" (CWD=/home/opam/.opam/5.2.0+flambda2/.opam-switch/build/core.v0.18~preview.130.36+326)
- (cd _build/default && /home/opam/.opam/5.2.0+flambda2/bin/ocamlc.opt -w -40 -g -bin-annot -bin-annot-occurrences -I core/src/.core.objs/byte -I /home/opam/.opam/5.2.0+flambda2/lib/backoff -I /home/opam/.opam/5.2.0+flambda2/lib/base -I /home/opam/.opam/5.2.0+flambda2/lib/base/md5 -I /home/opam/.opam/5.2.0+flambda2/lib/base/shadow_stdlib -I /home/opam/.opam/5.2.0+flambda2/lib/base_bigstring -I /home/opam/.opam/5.2.0+flambda2/lib/base_quickcheck -I /home/opam/.opam/5.2.0+flambda2/lib/base_quickcheck/ppx_quickcheck/runtime -I /home/opam/.opam/5.2.0+flambda2/lib/basement -I /home/opam/.opam/5.2.0+flambda2/lib/bin_prot -I /home/opam/.opam/5.2.0+flambda2/lib/bin_prot/shape -I /home/opam/.opam/5.2.0+flambda2/lib/fieldslib -I /home/opam/.opam/5.2.0+flambda2/lib/int_repr -I /home/opam/.opam/5.2.0+flambda2/lib/jane-street-headers -I /home/opam/.opam/5.2.0+flambda2/lib/ocaml_intrinsics_kernel -I /home/opam/.opam/5.2.0+flambda2/lib/parsexp -I /home/opam/.opam/5.2.0+flambda2/lib/portable -I /home/opam/.opam/5.2.0+flambda2/lib/portable/kernel -I /home/opam/.opam/5.2.0+flambda2/lib/ppx_assert/runtime-lib -I /home/opam/.opam/5.2.0+flambda2/lib/ppx_bench/runtime-lib -I /home/opam/.opam/5.2.0+flambda2/lib/ppx_compare/runtime-lib -I /home/opam/.opam/5.2.0+flambda2/lib/ppx_diff/diffable -I /home/opam/.opam/5.2.0+flambda2/lib/ppx_diff/diffable_cinaps -I /home/opam/.opam/5.2.0+flambda2/lib/ppx_enumerate/runtime-lib -I /home/opam/.opam/5.2.0+flambda2/lib/ppx_expect/config -I /home/opam/.opam/5.2.0+flambda2/lib/ppx_expect/config_types -I /home/opam/.opam/5.2.0+flambda2/lib/ppx_expect/make_corrected_file -I /home/opam/.opam/5.2.0+flambda2/lib/ppx_expect/runtime -I /home/opam/.opam/5.2.0+flambda2/lib/ppx_expect/runtime_types -I /home/opam/.opam/5.2.0+flambda2/lib/ppx_hash/base_internalhash_types -I /home/opam/.opam/5.2.0+flambda2/lib/ppx_hash/runtime-lib -I /home/opam/.opam/5.2.0+flambda2/lib/ppx_here/runtime-lib -I /home/opam/.opam/5.2.0+flambda2/lib/ppx_inline_test/config -I /home/opam/.opam/5.2.0+flambda2/lib/ppx_inline_test/runtime-lib -I /home/opam/.opam/5.2.0+flambda2/lib/ppx_log/syntax -I /home/opam/.opam/5.2.0+flambda2/lib/ppx_log/types -I /home/opam/.opam/5.2.0+flambda2/lib/ppx_module_timer/runtime -I /home/opam/.opam/5.2.0+flambda2/lib/ppx_sexp_conv/runtime-lib -I /home/opam/.opam/5.2.0+flambda2/lib/ppx_stable_witness/runtime -I /home/opam/.opam/5.2.0+flambda2/lib/ppx_stable_witness/stable_witness -I /home/opam/.opam/5.2.0+flambda2/lib/ppx_string/runtime -I /home/opam/.opam/5.2.0+flambda2/lib/ppx_typed_fields/typed_fields_lib -I /home/opam/.opam/5.2.0+flambda2/lib/ppx_typed_fields/typed_variants_lib -I /home/opam/.opam/5.2.0+flambda2/lib/ppxlib/print_diff -I /home/opam/.opam/5.2.0+flambda2/lib/sexplib -I /home/opam/.opam/5.2.0+flambda2/lib/sexplib0 -I /home/opam/.opam/5.2.0+flambda2/lib/splittable_random -I /home/opam/.opam/5.2.0+flambda2/lib/stdio -I /home/opam/.opam/5.2.0+flambda2/lib/string_dict -I /home/opam/.opam/5.2.0+flambda2/lib/time_now -I /home/opam/.opam/5.2.0+flambda2/lib/typerep -I /home/opam/.opam/5.2.0+flambda2/lib/univ_map -I /home/opam/.opam/5.2.0+flambda2/lib/uopt -I /home/opam/.opam/5.2.0+flambda2/lib/variantslib -I base_for_tests/src/.base_for_tests.objs/byte -I command/src/.command.objs/byte -I filename_base/src/.filename_base.objs/byte -I heap_block/.heap_block.objs/byte -I validate/src/.validate.objs/byte -intf-suffix .ml -no-alias-deps -open Core__ -o core/src/.core.objs/byte/core__Nothing.cmo -c -impl core/src/nothing.pp.ml)
- File "core/src/nothing.ml", line 60, characters 10-16:
- 60 |         | t :: _ -> unreachable_code t
-                ^^^^^^
- Warning 56 [unreachable-case]: this match case is unreachable.
- Consider replacing it with a refutation case '<pat> -> .'
- (cd _build/default && /home/opam/.opam/5.2.0+flambda2/bin/ocamlopt.opt -w -40 -g -O3 -flambda2-inline-max-depth 10 -I core/src/.core.objs/byte -I core/src/.core.objs/native -I /home/opam/.opam/5.2.0+flambda2/lib/backoff -I /home/opam/.opam/5.2.0+flambda2/lib/base -I /home/opam/.opam/5.2.0+flambda2/lib/base/md5 -I /home/opam/.opam/5.2.0+flambda2/lib/base/shadow_stdlib -I /home/opam/.opam/5.2.0+flambda2/lib/base_bigstring -I /home/opam/.opam/5.2.0+flambda2/lib/base_quickcheck -I /home/opam/.opam/5.2.0+flambda2/lib/base_quickcheck/ppx_quickcheck/runtime -I /home/opam/.opam/5.2.0+flambda2/lib/basement -I /home/opam/.opam/5.2.0+flambda2/lib/bin_prot -I /home/opam/.opam/5.2.0+flambda2/lib/bin_prot/shape -I /home/opam/.opam/5.2.0+flambda2/lib/fieldslib -I /home/opam/.opam/5.2.0+flambda2/lib/int_repr -I /home/opam/.opam/5.2.0+flambda2/lib/jane-street-headers -I /home/opam/.opam/5.2.0+flambda2/lib/ocaml_intrinsics_kernel -I /home/opam/.opam/5.2.0+flambda2/lib/parsexp -I /home/opam/.opam/5.2.0+flambda2/lib/portable -I /home/opam/.opam/5.2.0+flambda2/lib/portable/kernel -I /home/opam/.opam/5.2.0+flambda2/lib/ppx_assert/runtime-lib -I /home/opam/.opam/5.2.0+flambda2/lib/ppx_bench/runtime-lib -I /home/opam/.opam/5.2.0+flambda2/lib/ppx_compare/runtime-lib -I /home/opam/.opam/5.2.0+flambda2/lib/ppx_diff/diffable -I /home/opam/.opam/5.2.0+flambda2/lib/ppx_diff/diffable_cinaps -I /home/opam/.opam/5.2.0+flambda2/lib/ppx_enumerate/runtime-lib -I /home/opam/.opam/5.2.0+flambda2/lib/ppx_expect/config -I /home/opam/.opam/5.2.0+flambda2/lib/ppx_expect/config_types -I /home/opam/.opam/5.2.0+flambda2/lib/ppx_expect/make_corrected_file -I /home/opam/.opam/5.2.0+flambda2/lib/ppx_expect/runtime -I /home/opam/.opam/5.2.0+flambda2/lib/ppx_expect/runtime_types -I /home/opam/.opam/5.2.0+flambda2/lib/ppx_hash/base_internalhash_types -I /home/opam/.opam/5.2.0+flambda2/lib/ppx_hash/runtime-lib -I /home/opam/.opam/5.2.0+flambda2/lib/ppx_here/runtime-lib -I /home/opam/.opam/5.2.0+flambda2/lib/ppx_inline_test/config -I /home/opam/.opam/5.2.0+flambda2/lib/ppx_inline_test/runtime-lib -I /home/opam/.opam/5.2.0+flambda2/lib/ppx_log/syntax -I /home/opam/.opam/5.2.0+flambda2/lib/ppx_log/types -I /home/opam/.opam/5.2.0+flambda2/lib/ppx_module_timer/runtime -I /home/opam/.opam/5.2.0+flambda2/lib/ppx_sexp_conv/runtime-lib -I /home/opam/.opam/5.2.0+flambda2/lib/ppx_stable_witness/runtime -I /home/opam/.opam/5.2.0+flambda2/lib/ppx_stable_witness/stable_witness -I /home/opam/.opam/5.2.0+flambda2/lib/ppx_string/runtime -I /home/opam/.opam/5.2.0+flambda2/lib/ppx_typed_fields/typed_fields_lib -I /home/opam/.opam/5.2.0+flambda2/lib/ppx_typed_fields/typed_variants_lib -I /home/opam/.opam/5.2.0+flambda2/lib/ppxlib/print_diff -I /home/opam/.opam/5.2.0+flambda2/lib/sexplib -I /home/opam/.opam/5.2.0+flambda2/lib/sexplib0 -I /home/opam/.opam/5.2.0+flambda2/lib/splittable_random -I /home/opam/.opam/5.2.0+flambda2/lib/stdio -I /home/opam/.opam/5.2.0+flambda2/lib/string_dict -I /home/opam/.opam/5.2.0+flambda2/lib/time_now -I /home/opam/.opam/5.2.0+flambda2/lib/typerep -I /home/opam/.opam/5.2.0+flambda2/lib/univ_map -I /home/opam/.opam/5.2.0+flambda2/lib/uopt -I /home/opam/.opam/5.2.0+flambda2/lib/variantslib -I base_for_tests/src/.base_for_tests.objs/byte -I base_for_tests/src/.base_for_tests.objs/native -I command/src/.command.objs/byte -I command/src/.command.objs/native -I filename_base/src/.filename_base.objs/byte -I filename_base/src/.filename_base.objs/native -I heap_block/.heap_block.objs/byte -I heap_block/.heap_block.objs/native -I validate/src/.validate.objs/byte -I validate/src/.validate.objs/native -intf-suffix .ml -no-alias-deps -open Core__ -o core/src/.core.objs/native/core__Nothing.cmx -c -impl core/src/nothing.pp.ml)
- File "core/src/nothing.ml", line 60, characters 10-16:
- 60 |         | t :: _ -> unreachable_code t
-                ^^^^^^
- Warning 56 [unreachable-case]: this match case is unreachable.
- Consider replacing it with a refutation case '<pat> -> .'
-> compiled  core.v0.18~preview.130.36+326
-> installed core.v0.18~preview.130.36+326
Processing 260/267: [core_kernel: dune build]
Processing 261/267: [core_kernel: dune build] [expect_test_helpers_core: dune build]
+ /home/opam/.opam/opam-init/hooks/sandbox.sh "build" "dune" "build" "-p" "expect_test_helpers_core" "-j" "255" (CWD=/home/opam/.opam/5.2.0+flambda2/.opam-switch/build/expect_test_helpers_core.v0.18~preview.130.36+326)
-> compiled  expect_test_helpers_core.v0.18~preview.130.36+326
Processing 261/267: [core_kernel: dune build]
-> installed expect_test_helpers_core.v0.18~preview.130.36+326
Processing 262/267: [core_kernel: dune build]
+ /home/opam/.opam/opam-init/hooks/sandbox.sh "build" "dune" "build" "-p" "core_kernel" "-j" "255" (CWD=/home/opam/.opam/5.2.0+flambda2/.opam-switch/build/core_kernel.v0.18~preview.130.36+326)
- (cd _build/default && /home/opam/.opam/5.2.0+flambda2/bin/ocamlopt.opt -w -40 -g -I core_kernel/src/.core_kernel.objs/byte -I core_kernel/src/.core_kernel.objs/native -I /home/opam/.opam/5.2.0+flambda2/lib/backoff -I /home/opam/.opam/5.2.0+flambda2/lib/base -I /home/opam/.opam/5.2.0+flambda2/lib/base/md5 -I /home/opam/.opam/5.2.0+flambda2/lib/base/shadow_stdlib -I /home/opam/.opam/5.2.0+flambda2/lib/base_bigstring -I /home/opam/.opam/5.2.0+flambda2/lib/base_quickcheck -I /home/opam/.opam/5.2.0+flambda2/lib/base_quickcheck/ppx_quickcheck/runtime -I /home/opam/.opam/5.2.0+flambda2/lib/basement -I /home/opam/.opam/5.2.0+flambda2/lib/bin_prot -I /home/opam/.opam/5.2.0+flambda2/lib/bin_prot/shape -I /home/opam/.opam/5.2.0+flambda2/lib/core -I /home/opam/.opam/5.2.0+flambda2/lib/core/base_for_tests -I /home/opam/.opam/5.2.0+flambda2/lib/core/command -I /home/opam/.opam/5.2.0+flambda2/lib/core/filename_base -I /home/opam/.opam/5.2.0+flambda2/lib/core/heap_block -I /home/opam/.opam/5.2.0+flambda2/lib/core/validate -I /home/opam/.opam/5.2.0+flambda2/lib/fieldslib -I /home/opam/.opam/5.2.0+flambda2/lib/int_repr -I /home/opam/.opam/5.2.0+flambda2/lib/jane-street-headers -I /home/opam/.opam/5.2.0+flambda2/lib/ocaml_intrinsics_kernel -I /home/opam/.opam/5.2.0+flambda2/lib/parsexp -I /home/opam/.opam/5.2.0+flambda2/lib/portable -I /home/opam/.opam/5.2.0+flambda2/lib/portable/kernel -I /home/opam/.opam/5.2.0+flambda2/lib/ppx_assert/runtime-lib -I /home/opam/.opam/5.2.0+flambda2/lib/ppx_bench/runtime-lib -I /home/opam/.opam/5.2.0+flambda2/lib/ppx_compare/runtime-lib -I /home/opam/.opam/5.2.0+flambda2/lib/ppx_diff/diffable -I /home/opam/.opam/5.2.0+flambda2/lib/ppx_diff/diffable_cinaps -I /home/opam/.opam/5.2.0+flambda2/lib/ppx_enumerate/runtime-lib -I /home/opam/.opam/5.2.0+flambda2/lib/ppx_expect/config -I /home/opam/.opam/5.2.0+flambda2/lib/ppx_expect/config_types -I /home/opam/.opam/5.2.0+flambda2/lib/ppx_expect/make_corrected_file -I /home/opam/.opam/5.2.0+flambda2/lib/ppx_expect/runtime -I /home/opam/.opam/5.2.0+flambda2/lib/ppx_expect/runtime_types -I /home/opam/.opam/5.2.0+flambda2/lib/ppx_hash/base_internalhash_types -I /home/opam/.opam/5.2.0+flambda2/lib/ppx_hash/runtime-lib -I /home/opam/.opam/5.2.0+flambda2/lib/ppx_here/runtime-lib -I /home/opam/.opam/5.2.0+flambda2/lib/ppx_inline_test/config -I /home/opam/.opam/5.2.0+flambda2/lib/ppx_inline_test/runtime-lib -I /home/opam/.opam/5.2.0+flambda2/lib/ppx_log/syntax -I /home/opam/.opam/5.2.0+flambda2/lib/ppx_log/types -I /home/opam/.opam/5.2.0+flambda2/lib/ppx_module_timer/runtime -I /home/opam/.opam/5.2.0+flambda2/lib/ppx_sexp_conv/runtime-lib -I /home/opam/.opam/5.2.0+flambda2/lib/ppx_stable_witness/runtime -I /home/opam/.opam/5.2.0+flambda2/lib/ppx_stable_witness/stable_witness -I /home/opam/.opam/5.2.0+flambda2/lib/ppx_string/runtime -I /home/opam/.opam/5.2.0+flambda2/lib/ppx_typed_fields/typed_fields_lib -I /home/opam/.opam/5.2.0+flambda2/lib/ppx_typed_fields/typed_variants_lib -I /home/opam/.opam/5.2.0+flambda2/lib/ppxlib/print_diff -I /home/opam/.opam/5.2.0+flambda2/lib/sexplib -I /home/opam/.opam/5.2.0+flambda2/lib/sexplib0 -I /home/opam/.opam/5.2.0+flambda2/lib/splittable_random -I /home/opam/.opam/5.2.0+flambda2/lib/stdio -I /home/opam/.opam/5.2.0+flambda2/lib/string_dict -I /home/opam/.opam/5.2.0+flambda2/lib/time_now -I /home/opam/.opam/5.2.0+flambda2/lib/typerep -I /home/opam/.opam/5.2.0+flambda2/lib/univ_map -I /home/opam/.opam/5.2.0+flambda2/lib/uopt -I /home/opam/.opam/5.2.0+flambda2/lib/variantslib -intf-suffix .ml -no-alias-deps -o core_kernel/src/.core_kernel.objs/native/core_kernel.cmx -c -impl core_kernel/src/core_kernel.pp.ml)
- File "core_kernel/src/core_kernel.ml", line 1, characters 4-14:
- 1 | [@@@deprecated "[since 2021-05] Use [Core] -- [Core_kernel] was renamed as [Core]"]
-         ^^^^^^^^^^
- Warning 53 [misplaced-attribute]: the "deprecated" attribute cannot appear in this context
-> compiled  core_kernel.v0.18~preview.130.36+326
-> installed core_kernel.v0.18~preview.130.36+326
Processing 264/267: [core_unix: dune build]
+ /home/opam/.opam/opam-init/hooks/sandbox.sh "build" "dune" "build" "-p" "core_unix" "-j" "255" (CWD=/home/opam/.opam/5.2.0+flambda2/.opam-switch/build/core_unix.v0.18~preview.130.36+326)
- (cd _build/default && /home/opam/.opam/5.2.0+flambda2/bin/ocamlopt.opt -w -40 -g -I time_float_unix/time_unix/.time_unix.objs/byte -I time_float_unix/time_unix/.time_unix.objs/native -I /home/opam/.opam/5.2.0+flambda2/lib/backoff -I /home/opam/.opam/5.2.0+flambda2/lib/base -I /home/opam/.opam/5.2.0+flambda2/lib/base/md5 -I /home/opam/.opam/5.2.0+flambda2/lib/base/shadow_stdlib -I /home/opam/.opam/5.2.0+flambda2/lib/base_bigstring -I /home/opam/.opam/5.2.0+flambda2/lib/base_quickcheck -I /home/opam/.opam/5.2.0+flambda2/lib/base_quickcheck/ppx_quickcheck/runtime -I /home/opam/.opam/5.2.0+flambda2/lib/basement -I /home/opam/.opam/5.2.0+flambda2/lib/bin_prot -I /home/opam/.opam/5.2.0+flambda2/lib/bin_prot/shape -I /home/opam/.opam/5.2.0+flambda2/lib/core -I /home/opam/.opam/5.2.0+flambda2/lib/core/base_for_tests -I /home/opam/.opam/5.2.0+flambda2/lib/core/command -I /home/opam/.opam/5.2.0+flambda2/lib/core/filename_base -I /home/opam/.opam/5.2.0+flambda2/lib/core/heap_block -I /home/opam/.opam/5.2.0+flambda2/lib/core/validate -I /home/opam/.opam/5.2.0+flambda2/lib/core_kernel/caml_threads -I /home/opam/.opam/5.2.0+flambda2/lib/core_kernel/caml_unix -I /home/opam/.opam/5.2.0+flambda2/lib/core_kernel/flags -I /home/opam/.opam/5.2.0+flambda2/lib/fieldslib -I /home/opam/.opam/5.2.0+flambda2/lib/int_repr -I /home/opam/.opam/5.2.0+flambda2/lib/jane-street-headers -I /home/opam/.opam/5.2.0+flambda2/lib/ocaml/threads -I /home/opam/.opam/5.2.0+flambda2/lib/ocaml/unix -I /home/opam/.opam/5.2.0+flambda2/lib/ocaml_intrinsics_kernel -I /home/opam/.opam/5.2.0+flambda2/lib/parsexp -I /home/opam/.opam/5.2.0+flambda2/lib/portable -I /home/opam/.opam/5.2.0+flambda2/lib/portable/kernel -I /home/opam/.opam/5.2.0+flambda2/lib/ppx_assert/runtime-lib -I /home/opam/.opam/5.2.0+flambda2/lib/ppx_bench/runtime-lib -I /home/opam/.opam/5.2.0+flambda2/lib/ppx_compare/runtime-lib -I /home/opam/.opam/5.2.0+flambda2/lib/ppx_diff/diffable -I /home/opam/.opam/5.2.0+flambda2/lib/ppx_diff/diffable_cinaps -I /home/opam/.opam/5.2.0+flambda2/lib/ppx_enumerate/runtime-lib -I /home/opam/.opam/5.2.0+flambda2/lib/ppx_expect/config -I /home/opam/.opam/5.2.0+flambda2/lib/ppx_expect/config_types -I /home/opam/.opam/5.2.0+flambda2/lib/ppx_expect/make_corrected_file -I /home/opam/.opam/5.2.0+flambda2/lib/ppx_expect/runtime -I /home/opam/.opam/5.2.0+flambda2/lib/ppx_expect/runtime_types -I /home/opam/.opam/5.2.0+flambda2/lib/ppx_hash/base_internalhash_types -I /home/opam/.opam/5.2.0+flambda2/lib/ppx_hash/runtime-lib -I /home/opam/.opam/5.2.0+flambda2/lib/ppx_here/runtime-lib -I /home/opam/.opam/5.2.0+flambda2/lib/ppx_inline_test/config -I /home/opam/.opam/5.2.0+flambda2/lib/ppx_inline_test/runtime-lib -I /home/opam/.opam/5.2.0+flambda2/lib/ppx_log/syntax -I /home/opam/.opam/5.2.0+flambda2/lib/ppx_log/types -I /home/opam/.opam/5.2.0+flambda2/lib/ppx_module_timer/runtime -I /home/opam/.opam/5.2.0+flambda2/lib/ppx_sexp_conv/runtime-lib -I /home/opam/.opam/5.2.0+flambda2/lib/ppx_stable_witness/runtime -I /home/opam/.opam/5.2.0+flambda2/lib/ppx_stable_witness/stable_witness -I /home/opam/.opam/5.2.0+flambda2/lib/ppx_string/runtime -I /home/opam/.opam/5.2.0+flambda2/lib/ppx_typed_fields/typed_fields_lib -I /home/opam/.opam/5.2.0+flambda2/lib/ppx_typed_fields/typed_variants_lib -I /home/opam/.opam/5.2.0+flambda2/lib/ppxlib/print_diff -I /home/opam/.opam/5.2.0+flambda2/lib/sexplib -I /home/opam/.opam/5.2.0+flambda2/lib/sexplib/unix -I /home/opam/.opam/5.2.0+flambda2/lib/sexplib0 -I /home/opam/.opam/5.2.0+flambda2/lib/spawn -I /home/opam/.opam/5.2.0+flambda2/lib/splittable_random -I /home/opam/.opam/5.2.0+flambda2/lib/stdio -I /home/opam/.opam/5.2.0+flambda2/lib/string_dict -I /home/opam/.opam/5.2.0+flambda2/lib/time_now -I /home/opam/.opam/5.2.0+flambda2/lib/typerep -I /home/opam/.opam/5.2.0+flambda2/lib/univ_map -I /home/opam/.opam/5.2.0+flambda2/lib/uopt -I /home/opam/.opam/5.2.0+flambda2/lib/variantslib -I core_unix/src/.core_unix.objs/byte -I core_unix/src/.core_unix.objs/native -I error_checking_mutex/src/.error_checking_mutex.objs/byte -I error_checking_mutex/src/.error_checking_mutex.objs/native -I signal_unix/src/.signal_unix.objs/byte -I signal_unix/src/.signal_unix.objs/native -I time_float_unix/src/.time_float_unix.objs/byte -I time_float_unix/src/.time_float_unix.objs/native -intf-suffix .ml -no-alias-deps -o time_float_unix/time_unix/.time_unix.objs/native/time_unix.cmx -c -impl time_float_unix/time_unix/time_unix.pp.ml)
- File "time_float_unix/time_unix/time_unix.ml", line 1, characters 4-14:
- 1 | [@@@deprecated "[since 2022-04] Use [Time_float_unix] instead"]
-         ^^^^^^^^^^
- Warning 53 [misplaced-attribute]: the "deprecated" attribute cannot appear in this context
-> compiled  core_unix.v0.18~preview.130.36+326
-> installed core_unix.v0.18~preview.130.36+326
Processing 266/267: [torch: dune build]
+ /home/opam/.opam/opam-init/hooks/sandbox.sh "build" "dune" "build" "-p" "torch" "-j" "255" (CWD=/home/opam/.opam/5.2.0+flambda2/.opam-switch/build/torch.v0.18~preview.130.36+326)
- (cd _build/default && /home/opam/.opam/5.2.0+flambda2/bin/ocamlopt.opt -w -40 -g -I src/toplevel/.torch_toplevel.objs/byte -I src/toplevel/.torch_toplevel.objs/native -I /home/opam/.opam/5.2.0+flambda2/lib/base -I /home/opam/.opam/5.2.0+flambda2/lib/base/md5 -I /home/opam/.opam/5.2.0+flambda2/lib/base/shadow_stdlib -I /home/opam/.opam/5.2.0+flambda2/lib/base_quickcheck -I /home/opam/.opam/5.2.0+flambda2/lib/base_quickcheck/ppx_quickcheck/runtime -I /home/opam/.opam/5.2.0+flambda2/lib/basement -I /home/opam/.opam/5.2.0+flambda2/lib/bin_prot -I /home/opam/.opam/5.2.0+flambda2/lib/bin_prot/shape -I /home/opam/.opam/5.2.0+flambda2/lib/fieldslib -I /home/opam/.opam/5.2.0+flambda2/lib/jane-street-headers -I /home/opam/.opam/5.2.0+flambda2/lib/ocaml-compiler-libs/toplevel -I /home/opam/.opam/5.2.0+flambda2/lib/ocaml/compiler-libs -I /home/opam/.opam/5.2.0+flambda2/lib/ocaml_intrinsics_kernel -I /home/opam/.opam/5.2.0+flambda2/lib/parsexp -I /home/opam/.opam/5.2.0+flambda2/lib/ppx_assert/runtime-lib -I /home/opam/.opam/5.2.0+flambda2/lib/ppx_bench/runtime-lib -I /home/opam/.opam/5.2.0+flambda2/lib/ppx_compare/runtime-lib -I /home/opam/.opam/5.2.0+flambda2/lib/ppx_enumerate/runtime-lib -I /home/opam/.opam/5.2.0+flambda2/lib/ppx_expect/config -I /home/opam/.opam/5.2.0+flambda2/lib/ppx_expect/config_types -I /home/opam/.opam/5.2.0+flambda2/lib/ppx_expect/make_corrected_file -I /home/opam/.opam/5.2.0+flambda2/lib/ppx_expect/runtime -I /home/opam/.opam/5.2.0+flambda2/lib/ppx_expect/runtime_types -I /home/opam/.opam/5.2.0+flambda2/lib/ppx_hash/base_internalhash_types -I /home/opam/.opam/5.2.0+flambda2/lib/ppx_hash/runtime-lib -I /home/opam/.opam/5.2.0+flambda2/lib/ppx_here/runtime-lib -I /home/opam/.opam/5.2.0+flambda2/lib/ppx_inline_test/config -I /home/opam/.opam/5.2.0+flambda2/lib/ppx_inline_test/runtime-lib -I /home/opam/.opam/5.2.0+flambda2/lib/ppx_log/syntax -I /home/opam/.opam/5.2.0+flambda2/lib/ppx_log/types -I /home/opam/.opam/5.2.0+flambda2/lib/ppx_module_timer/runtime -I /home/opam/.opam/5.2.0+flambda2/lib/ppx_sexp_conv/runtime-lib -I /home/opam/.opam/5.2.0+flambda2/lib/ppx_stable_witness/runtime -I /home/opam/.opam/5.2.0+flambda2/lib/ppx_stable_witness/stable_witness -I /home/opam/.opam/5.2.0+flambda2/lib/ppx_string/runtime -I /home/opam/.opam/5.2.0+flambda2/lib/ppx_typed_fields/typed_fields_lib -I /home/opam/.opam/5.2.0+flambda2/lib/ppx_typed_fields/typed_variants_lib -I /home/opam/.opam/5.2.0+flambda2/lib/ppxlib/print_diff -I /home/opam/.opam/5.2.0+flambda2/lib/sexplib -I /home/opam/.opam/5.2.0+flambda2/lib/sexplib0 -I /home/opam/.opam/5.2.0+flambda2/lib/splittable_random -I /home/opam/.opam/5.2.0+flambda2/lib/stdio -I /home/opam/.opam/5.2.0+flambda2/lib/time_now -I /home/opam/.opam/5.2.0+flambda2/lib/typerep -I /home/opam/.opam/5.2.0+flambda2/lib/variantslib -intf-suffix .ml -no-alias-deps -o src/toplevel/.torch_toplevel.objs/native/torch_toplevel.cmx -c -impl src/toplevel/torch_toplevel.pp.ml)
- File "_none_", line 1:
- Warning 58 [no-cmx-file]: no cmx file was found in path for module Toploop, and its interface was not compiled with -opaque
- File "src/wrapper/dune", line 4, characters 9-18:
- 4 |   (names torch_api)
-              ^^^^^^^^^
- (cd _build/default/src/wrapper && /usr/bin/gcc -std=c++17 -fPIC -D_GLIBCXX_USE_CXX11_ABI=1 -g -I /home/opam/.opam/5.2.0+flambda2/lib/ocaml -I /home/opam/.opam/5.2.0+flambda2/lib/base -I /home/opam/.opam/5.2.0+flambda2/lib/base/md5 -I /home/opam/.opam/5.2.0+flambda2/lib/base/shadow_stdlib -I /home/opam/.opam/5.2.0+flambda2/lib/base_quickcheck -I /home/opam/.opam/5.2.0+flambda2/lib/base_quickcheck/ppx_quickcheck/runtime -I /home/opam/.opam/5.2.0+flambda2/lib/basement -I /home/opam/.opam/5.2.0+flambda2/lib/bigarray-compat -I /home/opam/.opam/5.2.0+flambda2/lib/bin_prot -I /home/opam/.opam/5.2.0+flambda2/lib/bin_prot/shape -I /home/opam/.opam/5.2.0+flambda2/lib/ctypes -I /home/opam/.opam/5.2.0+flambda2/lib/ctypes-foreign -I /home/opam/.opam/5.2.0+flambda2/lib/ctypes/stubs -I /home/opam/.opam/5.2.0+flambda2/lib/fieldslib -I /home/opam/.opam/5.2.0+flambda2/lib/integers -I /home/opam/.opam/5.2.0+flambda2/lib/jane-street-headers -I /home/opam/.opam/5.2.0+flambda2/lib/ocaml/str -I /home/opam/.opam/5.2.0+flambda2/lib/ocaml/threads -I /home/opam/.opam/5.2.0+flambda2/lib/ocaml/unix -I /home/opam/.opam/5.2.0+flambda2/lib/ocaml_intrinsics_kernel -I /home/opam/.opam/5.2.0+flambda2/lib/parsexp -I /home/opam/.opam/5.2.0+flambda2/lib/ppx_assert/runtime-lib -I /home/opam/.opam/5.2.0+flambda2/lib/ppx_bench/runtime-lib -I /home/opam/.opam/5.2.0+flambda2/lib/ppx_compare/runtime-lib -I /home/opam/.opam/5.2.0+flambda2/lib/ppx_enumerate/runtime-lib -I /home/opam/.opam/5.2.0+flambda2/lib/ppx_expect/config -I /home/opam/.opam/5.2.0+flambda2/lib/ppx_expect/config_types -I /home/opam/.opam/5.2.0+flambda2/lib/ppx_expect/make_corrected_file -I /home/opam/.opam/5.2.0+flambda2/lib/ppx_expect/runtime -I /home/opam/.opam/5.2.0+flambda2/lib/ppx_expect/runtime_types -I /home/opam/.opam/5.2.0+flambda2/lib/ppx_hash/base_internalhash_types -I /home/opam/.opam/5.2.0+flambda2/lib/ppx_hash/runtime-lib -I /home/opam/.opam/5.2.0+flambda2/lib/ppx_here/runtime-lib -I /home/opam/.opam/5.2.0+flambda2/lib/ppx_inline_test/config -I /home/opam/.opam/5.2.0+flambda2/lib/ppx_inline_test/runtime-lib -I /home/opam/.opam/5.2.0+flambda2/lib/ppx_log/syntax -I /home/opam/.opam/5.2.0+flambda2/lib/ppx_log/types -I /home/opam/.opam/5.2.0+flambda2/lib/ppx_module_timer/runtime -I /home/opam/.opam/5.2.0+flambda2/lib/ppx_sexp_conv/runtime-lib -I /home/opam/.opam/5.2.0+flambda2/lib/ppx_stable_witness/runtime -I /home/opam/.opam/5.2.0+flambda2/lib/ppx_stable_witness/stable_witness -I /home/opam/.opam/5.2.0+flambda2/lib/ppx_string/runtime -I /home/opam/.opam/5.2.0+flambda2/lib/ppx_typed_fields/typed_fields_lib -I /home/opam/.opam/5.2.0+flambda2/lib/ppx_typed_fields/typed_variants_lib -I /home/opam/.opam/5.2.0+flambda2/lib/ppxlib/print_diff -I /home/opam/.opam/5.2.0+flambda2/lib/sexplib -I /home/opam/.opam/5.2.0+flambda2/lib/sexplib0 -I /home/opam/.opam/5.2.0+flambda2/lib/splittable_random -I /home/opam/.opam/5.2.0+flambda2/lib/stdio -I /home/opam/.opam/5.2.0+flambda2/lib/stdlib-shims -I /home/opam/.opam/5.2.0+flambda2/lib/time_now -I /home/opam/.opam/5.2.0+flambda2/lib/typerep -I /home/opam/.opam/5.2.0+flambda2/lib/variantslib -I ../bindings -o torch_api.o -c torch_api.cpp)
- torch_api.cpp:1:10: fatal error: torch/csrc/autograd/engine.h: No such file or directory
-     1 | #include <torch/csrc/autograd/engine.h>
-       |          ^~~~~~~~~~~~~~~~~~~~~~~~~~~~~~
- compilation terminated.
[ERROR] The compilation of torch.v0.18~preview.130.36+326 failed at "dune build -p torch -j 255".

#=== ERROR while compiling torch.v0.18~preview.130.36+326 =====================#
# context              2.4.1 | linux/x86_64 | ocaml-variants.5.2.0+ox | git+file:///home/opam/oxcaml
# path                 ~/.opam/5.2.0+flambda2/.opam-switch/build/torch.v0.18~preview.130.36+326
# command              ~/.opam/opam-init/hooks/sandbox.sh build dune build -p torch -j 255
# exit-code            1
# env-file             ~/.opam/log/torch-8-757c16.env
# output-file          ~/.opam/log/torch-8-757c16.out
### output ###
# (cd _build/default && /home/opam/.opam/5.2.0+flambda2/bin/ocamlopt.opt -w -40 -g -I src/toplevel/.torch_toplevel.objs/byte -I src/toplevel/.torch_toplevel.objs/native -I /home/opam/.opam/5.2.0+flambda2/lib/base -I /home/opam/.opam/5.2.0+flambda2/lib/base/md5 -I /home/opam/.opam/5.2.0+flambda2/lib/base/shadow_stdlib -I /home/opam/.opam/5.2.0+flambda2/lib/base_quickcheck -I /home/opam/.opam/5.2.0+flambda2/lib/base_quickcheck/ppx_quickcheck/runtime -I /home/opam/.opam/5.2.0+flambda2/lib/basement -I /home/opam/.opam/5.2.0+flambda2/lib/bin_prot -I /home/opam/.opam/5.2.0+flambda2/lib/bin_prot/shape -I /home/opam/.opam/5.2.0+flambda2/lib/fieldslib -I /home/opam/.opam/5.2.0+flambda2/lib/jane-street-headers -I /home/opam/.opam/5.2.0+flambda2/lib/ocaml-compiler-libs/toplevel -I /home/opam/.opam/5.2.0+flambda2/lib/ocaml/compiler-libs -I /home/opam/.opam/5.2.0+flambda2/lib/ocaml_intrinsics_kernel -I /home/opam/.opam/5.2.0+flambda2/lib/parsexp -I /home/opam/.opam/5.2.0+flambda2/lib/ppx_assert/runtime-lib -I /home/opam/.opam/5.2.0+flambda2/lib/ppx_bench/runtime-lib -I /home/opam/.opam/5.2.0+flambda2/lib/ppx_compare/runtime-lib -I /home/opam/.opam/5.2.0+flambda2/lib/ppx_enumerate/runtime-lib -I /home/opam/.opam/5.2.0+flambda2/lib/ppx_expect/config -I /home/opam/.opam/5.2.0+flambda2/lib/ppx_expect/config_types -I /home/opam/.opam/5.2.0+flambda2/lib/ppx_expect/make_corrected_file -I /home/opam/.opam/5.2.0+flambda2/lib/ppx_expect/runtime -I /home/opam/.opam/5.2.0+flambda2/lib/ppx_expect/runtime_types -I /home/opam/.opam/5.2.0+flambda2/lib/ppx_hash/base_internalhash_types -I /home/opam/.opam/5.2.0+flambda2/lib/ppx_hash/runtime-lib -I /home/opam/.opam/5.2.0+flambda2/lib/ppx_here/runtime-lib -I /home/opam/.opam/5.2.0+flambda2/lib/ppx_inline_test/config -I /home/opam/.opam/5.2.0+flambda2/lib/ppx_inline_test/runtime-lib -I /home/opam/.opam/5.2.0+flambda2/lib/ppx_log/syntax -I /home/opam/.opam/5.2.0+flambda2/lib/ppx_log/types -I /home/opam/.opam/5.2.0+flambda2/lib/ppx_module_timer/runtime -I /home/opam/.opam/5.2.0+flambda2/lib/ppx_sexp_conv/runtime-lib -I /home/opam/.opam/5.2.0+flambda2/lib/ppx_stable_witness/runtime -I /home/opam/.opam/5.2.0+flambda2/lib/ppx_stable_witness/stable_witness -I /home/opam/.opam/5.2.0+flambda2/lib/ppx_string/runtime -I /home/opam/.opam/5.2.0+flambda2/lib/ppx_typed_fields/typed_fields_lib -I /home/opam/.opam/5.2.0+flambda2/lib/ppx_typed_fields/typed_variants_lib -I /home/opam/.opam/5.2.0+flambda2/lib/ppxlib/print_diff -I /home/opam/.opam/5.2.0+flambda2/lib/sexplib -I /home/opam/.opam/5.2.0+flambda2/lib/sexplib0 -I /home/opam/.opam/5.2.0+flambda2/lib/splittable_random -I /home/opam/.opam/5.2.0+flambda2/lib/stdio -I /home/opam/.opam/5.2.0+flambda2/lib/time_now -I /home/opam/.opam/5.2.0+flambda2/lib/typerep -I /home/opam/.opam/5.2.0+flambda2/lib/variantslib -intf-suffix .ml -no-alias-deps -o src/toplevel/.torch_toplevel.objs/native/torch_toplevel.cmx -c -impl src/toplevel/torch_toplevel.pp.ml)
# File "_none_", line 1:
# Warning 58 [no-cmx-file]: no cmx file was found in path for module Toploop, and its interface was not compiled with -opaque
# File "src/wrapper/dune", line 4, characters 9-18:
# 4 |   (names torch_api)
#              ^^^^^^^^^
# (cd _build/default/src/wrapper && /usr/bin/gcc -std=c++17 -fPIC -D_GLIBCXX_USE_CXX11_ABI=1 -g -I /home/opam/.opam/5.2.0+flambda2/lib/ocaml -I /home/opam/.opam/5.2.0+flambda2/lib/base -I /home/opam/.opam/5.2.0+flambda2/lib/base/md5 -I /home/opam/.opam/5.2.0+flambda2/lib/base/shadow_stdlib -I /home/opam/.opam/5.2.0+flambda2/lib/base_quickcheck -I /home/opam/.opam/5.2.0+flambda2/lib/base_quickcheck/ppx_quickcheck/runtime -I /home/opam/.opam/5.2.0+flambda2/lib/basement -I /home/opam/.opam/5.2.0+flambda2/lib/bigarray-compat -I /home/opam/.opam/5.2.0+flambda2/lib/bin_prot -I /home/opam/.opam/5.2.0+flambda2/lib/bin_prot/shape -I /home/opam/.opam/5.2.0+flambda2/lib/ctypes -I /home/opam/.opam/5.2.0+flambda2/lib/ctypes-foreign -I /home/opam/.opam/5.2.0+flambda2/lib/ctypes/stubs -I /home/opam/.opam/5.2.0+flambda2/lib/fieldslib -I /home/opam/.opam/5.2.0+flambda2/lib/integers -I /home/opam/.opam/5.2.0+flambda2/lib/jane-street-headers -I /home/opam/.opam/5.2.0+flambda2/lib/ocaml/str -I /home/opam/.opam/5.2.0+flambda2/lib/ocaml/threads -I /home/opam/.opam/5.2.0+flambda2/lib/ocaml/unix -I /home/opam/.opam/5.2.0+flambda2/lib/ocaml_intrinsics_kernel -I /home/opam/.opam/5.2.0+flambda2/lib/parsexp -I /home/opam/.opam/5.2.0+flambda2/lib/ppx_assert/runtime-lib -I /home/opam/.opam/5.2.0+flambda2/lib/ppx_bench/runtime-lib -I /home/opam/.opam/5.2.0+flambda2/lib/ppx_compare/runtime-lib -I /home/opam/.opam/5.2.0+flambda2/lib/ppx_enumerate/runtime-lib -I /home/opam/.opam/5.2.0+flambda2/lib/ppx_expect/config -I /home/opam/.opam/5.2.0+flambda2/lib/ppx_expect/config_types -I /home/opam/.opam/5.2.0+flambda2/lib/ppx_expect/make_corrected_file -I /home/opam/.opam/5.2.0+flambda2/lib/ppx_expect/runtime -I /home/opam/.opam/5.2.0+flambda2/lib/ppx_expect/runtime_types -I /home/opam/.opam/5.2.0+flambda2/lib/ppx_hash/base_internalhash_types -I /home/opam/.opam/5.2.0+flambda2/lib/ppx_hash/runtime-lib -I /home/opam/.opam/5.2.0+flambda2/lib/ppx_here/runtime-lib -I /home/opam/.opam/5.2.0+flambda2/lib/ppx_inline_test/config -I /home/opam/.opam/5.2.0+flambda2/lib/ppx_inline_test/runtime-lib -I /home/opam/.opam/5.2.0+flambda2/lib/ppx_log/syntax -I /home/opam/.opam/5.2.0+flambda2/lib/ppx_log/types -I /home/opam/.opam/5.2.0+flambda2/lib/ppx_module_timer/runtime -I /home/opam/.opam/5.2.0+flambda2/lib/ppx_sexp_conv/runtime-lib -I /home/opam/.opam/5.2.0+flambda2/lib/ppx_stable_witness/runtime -I /home/opam/.opam/5.2.0+flambda2/lib/ppx_stable_witness/stable_witness -I /home/opam/.opam/5.2.0+flambda2/lib/ppx_string/runtime -I /home/opam/.opam/5.2.0+flambda2/lib/ppx_typed_fields/typed_fields_lib -I /home/opam/.opam/5.2.0+flambda2/lib/ppx_typed_fields/typed_variants_lib -I /home/opam/.opam/5.2.0+flambda2/lib/ppxlib/print_diff -I /home/opam/.opam/5.2.0+flambda2/lib/sexplib -I /home/opam/.opam/5.2.0+flambda2/lib/sexplib0 -I /home/opam/.opam/5.2.0+flambda2/lib/splittable_random -I /home/opam/.opam/5.2.0+flambda2/lib/stdio -I /home/opam/.opam/5.2.0+flambda2/lib/stdlib-shims -I /home/opam/.opam/5.2.0+flambda2/lib/time_now -I /home/opam/.opam/5.2.0+flambda2/lib/typerep -I /home/opam/.opam/5.2.0+flambda2/lib/variantslib -I ../bindings -o torch_api.o -c torch_api.cpp)
# torch_api.cpp:1:10: fatal error: torch/csrc/autograd/engine.h: No such file or directory
#     1 | #include <torch/csrc/autograd/engine.h>
#       |          ^~~~~~~~~~~~~~~~~~~~~~~~~~~~~~
# compilation terminated.



<><> Error report <><><><><><><><><><><><><><><><><><><><><><><><><><><><><><><>
+- The following actions failed
| - build torch v0.18~preview.130.36+326
+- 
+- The following changes have been performed
| - install backoff                     0.1.1+ox
| - install base                        v0.18~preview.130.36+326
| - install base_bigstring              v0.18~preview.130.36+326
| - install base_quickcheck             v0.18~preview.130.36+326
| - install basement                    v0.18~preview.130.36+326
| - install bigarray-compat             1.1.0
| - install bin_prot                    v0.18~preview.130.36+326
| - install capitalization              v0.18~preview.130.36+326
| - install conf-bash                   1
| - install conf-libffi                 2.0.0
| - install conf-pkg-config             4
| - install core                        v0.18~preview.130.36+326
| - install core_kernel                 v0.18~preview.130.36+326
| - install core_unix                   v0.18~preview.130.36+326
| - install csexp                       1.5.2
| - install ctypes                      0.23.0
| - install ctypes-foreign              0.23.0
| - install dune                        3.19.1
| - install dune-configurator           3.19.1
| - install expect_test_helpers_core    v0.18~preview.130.36+326
| - install fieldslib                   v0.18~preview.130.36+326
| - install int_repr                    v0.18~preview.130.36+326
| - install integers                    0.7.0
| - install jane-street-headers         v0.18~preview.130.36+326
| - install jst-config                  v0.18~preview.130.36+326
| - install num                         1.6
| - install ocaml-compiler-libs         v0.17.0+ox
| - install ocaml_intrinsics_kernel     v0.18~preview.130.36+326
| - install parsexp                     v0.18~preview.130.36+326
| - install portable                    v0.18~preview.130.36+326
| - install ppx_assert                  v0.18~preview.130.36+326
| - install ppx_base                    v0.18~preview.130.36+326
| - install ppx_bench                   v0.18~preview.130.36+326
| - install ppx_bin_prot                v0.18~preview.130.36+326
| - install ppx_cold                    v0.18~preview.130.36+326
| - install ppx_compare                 v0.18~preview.130.36+326
| - install ppx_custom_printf           v0.18~preview.130.36+326
| - install ppx_derivers                1.2.1
| - install ppx_diff                    v0.18~preview.130.36+326
| - install ppx_disable_unused_warnings v0.18~preview.130.36+326
| - install ppx_enumerate               v0.18~preview.130.36+326
| - install ppx_expect                  v0.18~preview.130.36+326
| - install ppx_fields_conv             v0.18~preview.130.36+326
| - install ppx_fixed_literal           v0.18~preview.130.36+326
| - install ppx_globalize               v0.18~preview.130.36+326
| - install ppx_hash                    v0.18~preview.130.36+326
| - install ppx_helpers                 v0.18~preview.130.36+326
| - install ppx_here                    v0.18~preview.130.36+326
| - install ppx_ignore_instrumentation  v0.18~preview.130.36+326
| - install ppx_inline_test             v0.18~preview.130.36+326
| - install ppx_jane                    v0.18~preview.130.36+326
| - install ppx_let                     v0.18~preview.130.36+326
| - install ppx_log                     v0.18~preview.130.36+326
| - install ppx_module_timer            v0.18~preview.130.36+326
| - install ppx_optcomp                 v0.18~preview.130.36+326
| - install ppx_optional                v0.18~preview.130.36+326
| - install ppx_pipebang                v0.18~preview.130.36+326
| - install ppx_sexp_conv               v0.18~preview.130.36+326
| - install ppx_sexp_message            v0.18~preview.130.36+326
| - install ppx_sexp_value              v0.18~preview.130.36+326
| - install ppx_shorthand               v0.18~preview.130.36+326
| - install ppx_stable                  v0.18~preview.130.36+326
| - install ppx_stable_witness          v0.18~preview.130.36+326
| - install ppx_string                  v0.18~preview.130.36+326
| - install ppx_string_conv             v0.18~preview.130.36+326
| - install ppx_template                v0.18~preview.130.36+326
| - install ppx_tydi                    v0.18~preview.130.36+326
| - install ppx_typed_fields            v0.18~preview.130.36+326
| - install ppx_typerep_conv            v0.18~preview.130.36+326
| - install ppx_var_name                v0.18~preview.130.36+326
| - install ppx_variants_conv           v0.18~preview.130.36+326
| - install ppxlib                      0.33.0+ox
| - install ppxlib_ast                  0.33.0+ox
| - install ppxlib_jane                 v0.18~preview.130.36+326
| - install re                          1.13.2
| - install seq                         base
| - install sexp_pretty                 v0.18~preview.130.36+326
| - install sexplib                     v0.18~preview.130.36+326
| - install sexplib0                    v0.18~preview.130.36+326
| - install spawn                       v0.17.0
| - install splittable_random           v0.18~preview.130.36+326
| - install stdio                       v0.18~preview.130.36+326
| - install stdlib-shims                0.3.0
| - install string_dict                 v0.18~preview.130.36+326
| - install time_now                    v0.18~preview.130.36+326
| - install typerep                     v0.18~preview.130.36+326
| - install univ_map                    v0.18~preview.130.36+326
| - install uopt                        v0.18~preview.130.36+326
| - install variantslib                 v0.18~preview.130.36+326
+- 
# To update the current shell environment, run: eval $(opam env)

The former state can be restored with:
    /usr/bin/opam switch import "/home/opam/.opam/5.2.0+flambda2/.opam-switch/backup/state-20250807084308.export"
'opam install -vy torch.v0.18~preview.130.36+326' failed.
"/usr/bin/env" "bash" "-c" "opam remove -y torch.v0.18~preview.130.36+326
opam install -vy torch.v0.18~preview.130.36+326
res=$?
if [ $res = 31 ]; then
    if opam show -f x-ci-accept-failures: torch.v0.18~preview.130.36+326 | grep -q 'debian-unstable'; then
        echo "This package failed and has been disabled for CI using the 'x-ci-accept-failures' field."
        exit 69
    fi
fi 


exit $res" failed with exit status 31
Failed: Build failed