OCamllabs icon Home|Differences with the last checks|Previous runs


Building on phoebe

(from ocaml/opam:debian-unstable)
Unable to find image 'ocaml/opam:debian-unstable' locally
debian-unstable: Pulling from ocaml/opam
Digest: sha256:867738023289fd26cdb69fad77687cf4ed3a8bf60dcddabdf3cc53c705746fd2
Status: Downloaded newer image for ocaml/opam:debian-unstable
2025-08-07 08:17.21 ---> using "0acd5aeaa8f7bc314514d9795d14a7f12ec72a6a5b11c5904350189734c6859b" from cache

/: (user (uid 1000) (gid 1000))

/: (env OPAMPRECISETRACKING 1)

/: (env OPAMUTF8 never)

/: (env OPAMEXTERNALSOLVER builtin-0install)

/: (env OPAMCRITERIA +removed)

/: (env CI true)

/: (env OPAM_HEALTH_CHECK_CI true)

/: (run (shell "sudo ln -f /usr/bin/opam-dev /usr/bin/opam"))
2025-08-07 08:17.21 ---> using "40df4fa4cdfc68a5fa7a326047e82a7adc5df52b8059d4a7b745bdd50aad56e7" from cache

/: (run (network host)
        (shell "rm -rf ~/opam-repository && git clone -q 'https://github.com/ocaml/opam-repository' ~/opam-repository && git -C ~/opam-repository checkout -q 06a1064b82e87c7ef006235ec98f1c89487892c9"))
2025-08-07 08:17.21 ---> using "190c02cbe0dbf4a8b0af5361aa9e25640f87291c4fe861cc6cf855e0fda3a8c0" from cache

/: (run (shell "rm -rf ~/.opam && opam init -ya --bare --config ~/.opamrc-sandbox ~/opam-repository"))
Configuring from /home/opam/.opamrc-sandbox, then /home/opam/.opamrc, and finally from built-in defaults.
Checking for available remotes: rsync and local, git.
  - you won't be able to use mercurial repositories unless you install the hg command on your system.
  - you won't be able to use darcs repositories unless you install the darcs command on your system.


<><> Fetching repository information ><><><><><><><><><><><><><><><><><><><><><>
[default] Initialised

User configuration:
  ~/.profile is already up-to-date.
[NOTE] Make sure that ~/.profile is well sourced in your ~/.bashrc.

2025-08-07 08:17.21 ---> using "012c52728bded521bf1d53a4382a5dac829cfe1a6f3ed7b53cc733c53b2d91cb" from cache

/: (run (cache (opam-archives (target /home/opam/.opam/download-cache)))
        (network host)
        (shell "sudo apt update && sudo apt install autoconf -y"))

WARNING: apt does not have a stable CLI interface. Use with caution in scripts.

Get:1 http://deb.debian.org/debian unstable InRelease [216 kB]
Get:2 http://deb.debian.org/debian unstable/main amd64 Packages.diff/Index [63.6 kB]
Get:3 http://deb.debian.org/debian unstable/main amd64 Packages T-2025-08-07-0205.44-F-2025-08-02-0804.37.pdiff [69.1 kB]
Get:3 http://deb.debian.org/debian unstable/main amd64 Packages T-2025-08-07-0205.44-F-2025-08-02-0804.37.pdiff [69.1 kB]
Fetched 348 kB in 2s (144 kB/s)
Reading package lists...
Building dependency tree...
Reading state information...
4 packages can be upgraded. Run 'apt list --upgradable' to see them.

WARNING: apt does not have a stable CLI interface. Use with caution in scripts.

Reading package lists...
Building dependency tree...
Reading state information...
Installing:
  autoconf

Installing dependencies:
  automake  autotools-dev  m4

Suggested packages:
  autoconf-archive  gnu-standards  autoconf-doc  libtool  gettext  m4-doc

Summary:
  Upgrading: 0, Installing: 4, Removing: 0, Not Upgrading: 4
  Download size: 1710 kB
  Space needed: 5051 kB / 220 GB available

Get:1 http://deb.debian.org/debian unstable/main amd64 m4 amd64 1.4.19-8 [294 kB]
Get:2 http://deb.debian.org/debian unstable/main amd64 autoconf all 2.72-3.1 [494 kB]
Get:3 http://deb.debian.org/debian unstable/main amd64 autotools-dev all 20240727.1 [60.2 kB]
Get:4 http://deb.debian.org/debian unstable/main amd64 automake all 1:1.17-4 [862 kB]
Fetched 1710 kB in 0s (21.5 MB/s)
Selecting previously unselected package m4.
(Reading database ... 
(Reading database ... 5%
(Reading database ... 10%
(Reading database ... 15%
(Reading database ... 20%
(Reading database ... 25%
(Reading database ... 30%
(Reading database ... 35%
(Reading database ... 40%
(Reading database ... 45%
(Reading database ... 50%
(Reading database ... 55%
(Reading database ... 60%
(Reading database ... 65%
(Reading database ... 70%
(Reading database ... 75%
(Reading database ... 80%
(Reading database ... 85%
(Reading database ... 90%
(Reading database ... 95%
(Reading database ... 100%
(Reading database ... 20685 files and directories currently installed.)
Preparing to unpack .../archives/m4_1.4.19-8_amd64.deb ...
Unpacking m4 (1.4.19-8) ...
Selecting previously unselected package autoconf.
Preparing to unpack .../autoconf_2.72-3.1_all.deb ...
Unpacking autoconf (2.72-3.1) ...
Selecting previously unselected package autotools-dev.
Preparing to unpack .../autotools-dev_20240727.1_all.deb ...
Unpacking autotools-dev (20240727.1) ...
Selecting previously unselected package automake.
Preparing to unpack .../automake_1%3a1.17-4_all.deb ...
Unpacking automake (1:1.17-4) ...
Setting up m4 (1.4.19-8) ...
Setting up autotools-dev (20240727.1) ...
Setting up autoconf (2.72-3.1) ...
Setting up automake (1:1.17-4) ...
update-alternatives: using /usr/bin/automake-1.17 to provide /usr/bin/automake (automake) in auto mode
2025-08-07 08:17.21 ---> using "159374d4dfbeb7f87b486ade5afe9a00b3d6b0bdba42573a1887cdb5e30fe45b" from cache

/: (run (network host)
        (shell "git clone -q 'https://github.com/oxcaml/opam-repository' ~/'oxcaml' && git -C ~/'oxcaml' checkout -q 29656e8e76b4441b5b62db11d35d193e380298ca"))
2025-08-07 08:17.21 ---> using "b5848cf3bbbc0c4981e5d5e3d9bcec3b4c6b4225e188081cd30294eec97db7b4" from cache

/: (run (shell "opam repository add --dont-select 'oxcaml' ~/'oxcaml'"))
[oxcaml] Initialised
2025-08-07 08:17.21 ---> using "c846a1cc387dcbe1a71e6838f59ad7ff1920eabe18952f84a40fd0b2a4641443" from cache

/: (run (cache (opam-archives (target /home/opam/.opam/download-cache)))
        (network host)
        (shell "opam switch create --repositories=oxcaml,default '5.2.0+flambda2' '5.2.0+ox'"))

<><> Installing new switch packages <><><><><><><><><><><><><><><><><><><><><><>
Switch invariant: ["ocaml-variants" {= "5.2.0+ox"}]

<><> Processing actions <><><><><><><><><><><><><><><><><><><><><><><><><><><><>
-> retrieved ocaml-config.3  (cached)
-> installed base-bigarray.base
-> installed base-threads.base
-> installed base-unix.base
-> installed ocaml-options-vanilla.1
-> installed conf-autoconf.0.2
-> installed conf-which.1
-> retrieved ocaml-variants.5.2.0+ox  (https://github.com/oxcaml/oxcaml/archive/refs/tags/5.2.0minus-11-opam.tar.gz)
-> installed ocaml-variants.5.2.0+ox
-> installed ocaml-config.3
-> installed ocaml.5.2.0
-> installed base-domains.base
-> installed base-nnp.base
Done.
# To update the current shell environment, run: eval $(opam env --switch=5.2.0+flambda2)
2025-08-07 08:17.21 ---> using "059e4c8d9fde813aed5ba328af1b91f6cd5242b6bc0b704a2be07cd5d14bb4e8" from cache

/: (run (network host)
        (shell "opam update --depexts"))
+ /usr/bin/sudo "apt-get" "update"
- Hit:1 http://deb.debian.org/debian unstable InRelease
- Reading package lists...
2025-08-07 08:17.21 ---> using "7b9500581933009c35fa6ed9ef22a28eda258d356f0b06a637af33ddf697e0af" from cache

/: (run (cache (opam-archives (target /home/opam/.opam/download-cache)))
        (network host)
        (shell  "opam remove -y mysql8.1.0\
               \nopam install -vy mysql8.1.0\
               \nres=$?\
               \nif [ $res = 31 ]; then\
               \n    if opam show -f x-ci-accept-failures: mysql8.1.0 | grep -q 'debian-unstable'; then\
               \n        echo \"This package failed and has been disabled for CI using the 'x-ci-accept-failures' field.\"\
               \n        exit 69\
               \n    fi\
               \nfi \
               \n\
               \n\
               \nexit $res"))
[NOTE] mysql8.1.0 is not installed.

Nothing to do.
The following actions will be performed:
=== install 34 packages
  - install base                    v0.18~preview.130.36+326 [required by ppx_inline_test]
  - install basement                v0.18~preview.130.36+326 [required by base]
  - install conf-bash               1                        [required by ppxlib_ast]
  - install conf-mysql              1                        [required by mysql8]
  - install csexp                   1.5.2                    [required by dune-configurator]
  - install dune                    3.19.1                   [required by mysql8]
  - install dune-configurator       3.19.1                   [required by mysql8]
  - install jane-street-headers     v0.18~preview.130.36+326 [required by time_now]
  - install jst-config              v0.18~preview.130.36+326 [required by time_now]
  - install mysql8                  1.0
  - install ocaml-compiler-libs     v0.17.0+ox               [required by ppx_optcomp]
  - install ocaml_intrinsics_kernel v0.18~preview.130.36+326 [required by base]
  - install ppx_assert              v0.18~preview.130.36+326 [required by jst-config]
  - install ppx_base                v0.18~preview.130.36+326 [required by base, time_now]
  - install ppx_cold                v0.18~preview.130.36+326 [required by base]
  - install ppx_compare             v0.18~preview.130.36+326 [required by ppx_base]
  - install ppx_derivers            1.2.1                    [required by ppxlib]
  - install ppx_enumerate           v0.18~preview.130.36+326 [required by ppx_base]
  - install ppx_globalize           v0.18~preview.130.36+326 [required by ppx_base]
  - install ppx_hash                v0.18~preview.130.36+326 [required by base]
  - install ppx_helpers             v0.18~preview.130.36+326 [required by ppx_sexp_conv]
  - install ppx_here                v0.18~preview.130.36+326 [required by ppx_assert]
  - install ppx_inline_test         v0.18~preview.130.36+326 [required by mysql8]
  - install ppx_optcomp             v0.18~preview.130.36+326 [required by time_now]
  - install ppx_sexp_conv           v0.18~preview.130.36+326 [required by ppx_base]
  - install ppx_shorthand           v0.18~preview.130.36+326 [required by ppx_base]
  - install ppx_template            v0.18~preview.130.36+326 [required by ppx_base]
  - install ppxlib                  0.33.0+ox                [required by ppx_inline_test]
  - install ppxlib_ast              0.33.0+ox                [required by ppxlib]
  - install ppxlib_jane             v0.18~preview.130.36+326 [required by base]
  - install sexplib0                v0.18~preview.130.36+326 [required by ppx_inline_test]
  - install stdio                   v0.18~preview.130.36+326 [required by ppx_optcomp]
  - install stdlib-shims            0.3.0                    [required by ppxlib]
  - install time_now                v0.18~preview.130.36+326 [required by ppx_inline_test]

The following system packages will first need to be installed:
    default-libmysqlclient-dev

<><> Handling external dependencies <><><><><><><><><><><><><><><><><><><><><><>

opam believes some required external dependencies are missing. opam can:
> 1. Run apt-get to install them (may need root/sudo access)
  2. Display the recommended apt-get command and wait while you run it manually (e.g. in another terminal)
  3. Continue anyway, and, upon success, permanently register that this external dependency is present, but not detectable
  4. Abort the installation

[1/2/3/4] 1

+ /usr/bin/sudo "apt-get" "install" "-qq" "-yy" "default-libmysqlclient-dev"
- Selecting previously unselected package mysql-common.
- (Reading database ... 
(Reading database ... 5%
(Reading database ... 10%
(Reading database ... 15%
(Reading database ... 20%
(Reading database ... 25%
(Reading database ... 30%
(Reading database ... 35%
(Reading database ... 40%
(Reading database ... 45%
(Reading database ... 50%
(Reading database ... 55%
(Reading database ... 60%
(Reading database ... 65%
(Reading database ... 70%
(Reading database ... 75%
(Reading database ... 80%
(Reading database ... 85%
(Reading database ... 90%
(Reading database ... 95%
(Reading database ... 100%
(Reading database ... 21005 files and directories currently installed.)
- Preparing to unpack .../0-mysql-common_5.8+1.1.1_all.deb ...
- Unpacking mysql-common (5.8+1.1.1) ...
- Selecting previously unselected package mariadb-common.
- Preparing to unpack .../1-mariadb-common_1%3a11.8.2-1_all.deb ...
- Unpacking mariadb-common (1:11.8.2-1) ...
- Selecting previously unselected package libmariadb3:amd64.
- Preparing to unpack .../2-libmariadb3_1%3a11.8.2-1_amd64.deb ...
- Unpacking libmariadb3:amd64 (1:11.8.2-1) ...
- Selecting previously unselected package libssl-dev:amd64.
- Preparing to unpack .../3-libssl-dev_3.5.1-1_amd64.deb ...
- Unpacking libssl-dev:amd64 (3.5.1-1) ...
- Selecting previously unselected package zlib1g-dev:amd64.
- Preparing to unpack .../4-zlib1g-dev_1%3a1.3.dfsg+really1.3.1-1+b1_amd64.deb ...
- Unpacking zlib1g-dev:amd64 (1:1.3.dfsg+really1.3.1-1+b1) ...
- Selecting previously unselected package libmariadb-dev.
- Preparing to unpack .../5-libmariadb-dev_1%3a11.8.2-1_amd64.deb ...
- Unpacking libmariadb-dev (1:11.8.2-1) ...
- Selecting previously unselected package libmariadb-dev-compat.
- Preparing to unpack .../6-libmariadb-dev-compat_1%3a11.8.2-1_amd64.deb ...
- Unpacking libmariadb-dev-compat (1:11.8.2-1) ...
- Selecting previously unselected package default-libmysqlclient-dev:amd64.
- Preparing to unpack .../7-default-libmysqlclient-dev_1.1.1_amd64.deb ...
- Unpacking default-libmysqlclient-dev:amd64 (1.1.1) ...
- Setting up mysql-common (5.8+1.1.1) ...
- update-alternatives: using /etc/mysql/my.cnf.fallback to provide /etc/mysql/my.cnf (my.cnf) in auto mode
- Setting up mariadb-common (1:11.8.2-1) ...
- update-alternatives: using /etc/mysql/mariadb.cnf to provide /etc/mysql/my.cnf (my.cnf) in auto mode
- Setting up libssl-dev:amd64 (3.5.1-1) ...
- Setting up libmariadb3:amd64 (1:11.8.2-1) ...
- Setting up zlib1g-dev:amd64 (1:1.3.dfsg+really1.3.1-1+b1) ...
- Setting up libmariadb-dev (1:11.8.2-1) ...
- Setting up libmariadb-dev-compat (1:11.8.2-1) ...
- Setting up default-libmysqlclient-dev:amd64 (1.1.1) ...
- Processing triggers for libc-bin (2.41-11) ...

<><> Processing actions <><><><><><><><><><><><><><><><><><><><><><><><><><><><>
Processing  1/100: [base.v0.18~preview.130.36+326: extract]
Processing  2/100: [base.v0.18~preview.130.36+326: extract] [basement.v0.18~preview.130.36+326: extract]
Processing  3/100: [base.v0.18~preview.130.36+326: extract] [basement.v0.18~preview.130.36+326: extract]
Processing  4/100: [base.v0.18~preview.130.36+326: extract] [basement.v0.18~preview.130.36+326: extract]
Processing  5/100: [base.v0.18~preview.130.36+326: extract] [basement.v0.18~preview.130.36+326: extract] [csexp.1.5.2: extract]
Processing  6/100: [base.v0.18~preview.130.36+326: extract] [basement.v0.18~preview.130.36+326: extract] [csexp.1.5.2: extract] [conf-bash: bash]
Processing  7/100: [base.v0.18~preview.130.36+326: extract] [basement.v0.18~preview.130.36+326: extract] [csexp.1.5.2: extract] [conf-bash: bash] [conf-mysql: mysql_config]
-> retrieved base.v0.18~preview.130.36+326  (cached)
Processing  7/100: [basement.v0.18~preview.130.36+326: extract] [csexp.1.5.2: extract] [conf-bash: bash] [conf-mysql: mysql_config]
Processing  8/100: [basement.v0.18~preview.130.36+326: extract] [csexp.1.5.2: extract] [dune.3.19.1, dune-configurator.3.19.1: extract] [conf-bash: bash] [conf-mysql: mysql_config]
-> retrieved basement.v0.18~preview.130.36+326  (cached)
Processing  8/100: [csexp.1.5.2: extract] [dune.3.19.1, dune-configurator.3.19.1: extract] [conf-bash: bash] [conf-mysql: mysql_config]
Processing  9/100: [csexp.1.5.2: extract] [dune.3.19.1, dune-configurator.3.19.1: extract] [jane-street-headers.v0.18~preview.130.36+326: extract] [conf-bash: bash] [conf-mysql: mysql_config]
-> retrieved csexp.1.5.2  (cached)
Processing  9/100: [dune.3.19.1, dune-configurator.3.19.1: extract] [jane-street-headers.v0.18~preview.130.36+326: extract] [conf-bash: bash] [conf-mysql: mysql_config]
Processing 10/100: [dune.3.19.1, dune-configurator.3.19.1: extract] [jane-street-headers.v0.18~preview.130.36+326: extract] [jst-config.v0.18~preview.130.36+326: extract] [conf-bash: bash] [conf-mysql: mysql_config]
+ /home/opam/.opam/opam-init/hooks/sandbox.sh "build" "bash" "--version" (CWD=/home/opam/.opam/5.2.0+flambda2/.opam-switch/build/conf-bash.1)
- GNU bash, version 5.2.37(1)-release (x86_64-pc-linux-gnu)
- Copyright (C) 2022 Free Software Foundation, Inc.
- License GPLv3+: GNU GPL version 3 or later <http://gnu.org/licenses/gpl.html>
- 
- This is free software; you are free to change and redistribute it.
- There is NO WARRANTY, to the extent permitted by law.
-> compiled  conf-bash.1
Processing 10/100: [dune.3.19.1, dune-configurator.3.19.1: extract] [jane-street-headers.v0.18~preview.130.36+326: extract] [jst-config.v0.18~preview.130.36+326: extract] [conf-mysql: mysql_config]
-> installed conf-bash.1
Processing 11/100: [dune.3.19.1, dune-configurator.3.19.1: extract] [jane-street-headers.v0.18~preview.130.36+326: extract] [jst-config.v0.18~preview.130.36+326: extract] [conf-mysql: mysql_config]
+ /home/opam/.opam/opam-init/hooks/sandbox.sh "build" "mysql_config" "--include" (CWD=/home/opam/.opam/5.2.0+flambda2/.opam-switch/build/conf-mysql.1)
- -I/usr/include/mariadb -I/usr/include/mariadb/mysql
-> compiled  conf-mysql.1
Processing 11/100: [dune.3.19.1, dune-configurator.3.19.1: extract] [jane-street-headers.v0.18~preview.130.36+326: extract] [jst-config.v0.18~preview.130.36+326: extract]
-> installed conf-mysql.1
Processing 12/100: [dune.3.19.1, dune-configurator.3.19.1: extract] [jane-street-headers.v0.18~preview.130.36+326: extract] [jst-config.v0.18~preview.130.36+326: extract]
-> retrieved jane-street-headers.v0.18~preview.130.36+326  (cached)
Processing 12/100: [dune.3.19.1, dune-configurator.3.19.1: extract] [jst-config.v0.18~preview.130.36+326: extract]
Processing 13/100: [dune.3.19.1, dune-configurator.3.19.1: extract] [jst-config.v0.18~preview.130.36+326: extract] [mysql8.1.0: extract]
-> retrieved jst-config.v0.18~preview.130.36+326  (cached)
Processing 13/100: [dune.3.19.1, dune-configurator.3.19.1: extract] [mysql8.1.0: extract]
Processing 14/100: [dune.3.19.1, dune-configurator.3.19.1: extract] [mysql8.1.0: extract] [ocaml-compiler-libs.v0.17.0+ox: extract]
-> retrieved mysql8.1.0  (cached)
Processing 14/100: [dune.3.19.1, dune-configurator.3.19.1: extract] [ocaml-compiler-libs.v0.17.0+ox: extract]
Processing 15/100: [dune.3.19.1, dune-configurator.3.19.1: extract] [ocaml-compiler-libs.v0.17.0+ox: extract] [ocaml_intrinsics_kernel.v0.18~preview.130.36+326: extract]
-> retrieved ocaml-compiler-libs.v0.17.0+ox  (cached)
Processing 15/100: [dune.3.19.1, dune-configurator.3.19.1: extract] [ocaml_intrinsics_kernel.v0.18~preview.130.36+326: extract]
Processing 16/100: [dune.3.19.1, dune-configurator.3.19.1: extract] [ocaml_intrinsics_kernel.v0.18~preview.130.36+326: extract] [ppx_assert.v0.18~preview.130.36+326: extract]
-> retrieved ocaml_intrinsics_kernel.v0.18~preview.130.36+326  (cached)
Processing 16/100: [dune.3.19.1, dune-configurator.3.19.1: extract] [ppx_assert.v0.18~preview.130.36+326: extract]
Processing 17/100: [dune.3.19.1, dune-configurator.3.19.1: extract] [ppx_assert.v0.18~preview.130.36+326: extract] [ppx_base.v0.18~preview.130.36+326: extract]
-> retrieved ppx_assert.v0.18~preview.130.36+326  (cached)
Processing 17/100: [dune.3.19.1, dune-configurator.3.19.1: extract] [ppx_base.v0.18~preview.130.36+326: extract]
Processing 18/100: [dune.3.19.1, dune-configurator.3.19.1: extract] [ppx_base.v0.18~preview.130.36+326: extract] [ppx_cold.v0.18~preview.130.36+326: extract]
-> retrieved ppx_base.v0.18~preview.130.36+326  (cached)
Processing 18/100: [dune.3.19.1, dune-configurator.3.19.1: extract] [ppx_cold.v0.18~preview.130.36+326: extract]
Processing 19/100: [dune.3.19.1, dune-configurator.3.19.1: extract] [ppx_cold.v0.18~preview.130.36+326: extract] [ppx_compare.v0.18~preview.130.36+326: extract]
-> retrieved ppx_cold.v0.18~preview.130.36+326  (cached)
Processing 19/100: [dune.3.19.1, dune-configurator.3.19.1: extract] [ppx_compare.v0.18~preview.130.36+326: extract]
Processing 20/100: [dune.3.19.1, dune-configurator.3.19.1: extract] [ppx_compare.v0.18~preview.130.36+326: extract] [ppx_derivers.1.2.1: extract]
-> retrieved ppx_compare.v0.18~preview.130.36+326  (cached)
Processing 20/100: [dune.3.19.1, dune-configurator.3.19.1: extract] [ppx_derivers.1.2.1: extract]
Processing 21/100: [dune.3.19.1, dune-configurator.3.19.1: extract] [ppx_derivers.1.2.1: extract] [ppx_enumerate.v0.18~preview.130.36+326: extract]
-> retrieved ppx_derivers.1.2.1  (cached)
Processing 21/100: [dune.3.19.1, dune-configurator.3.19.1: extract] [ppx_enumerate.v0.18~preview.130.36+326: extract]
Processing 22/100: [dune.3.19.1, dune-configurator.3.19.1: extract] [ppx_enumerate.v0.18~preview.130.36+326: extract] [ppx_globalize.v0.18~preview.130.36+326: extract]
-> retrieved ppx_enumerate.v0.18~preview.130.36+326  (cached)
Processing 22/100: [dune.3.19.1, dune-configurator.3.19.1: extract] [ppx_globalize.v0.18~preview.130.36+326: extract]
Processing 23/100: [dune.3.19.1, dune-configurator.3.19.1: extract] [ppx_globalize.v0.18~preview.130.36+326: extract] [ppx_hash.v0.18~preview.130.36+326: extract]
-> retrieved ppx_globalize.v0.18~preview.130.36+326  (cached)
Processing 23/100: [dune.3.19.1, dune-configurator.3.19.1: extract] [ppx_hash.v0.18~preview.130.36+326: extract]
Processing 24/100: [dune.3.19.1, dune-configurator.3.19.1: extract] [ppx_hash.v0.18~preview.130.36+326: extract] [ppx_helpers.v0.18~preview.130.36+326: extract]
-> retrieved ppx_helpers.v0.18~preview.130.36+326  (cached)
Processing 24/100: [dune.3.19.1, dune-configurator.3.19.1: extract] [ppx_hash.v0.18~preview.130.36+326: extract]
Processing 25/100: [dune.3.19.1, dune-configurator.3.19.1: extract] [ppx_hash.v0.18~preview.130.36+326: extract] [ppx_here.v0.18~preview.130.36+326: extract]
-> retrieved ppx_hash.v0.18~preview.130.36+326  (cached)
Processing 25/100: [dune.3.19.1, dune-configurator.3.19.1: extract] [ppx_here.v0.18~preview.130.36+326: extract]
Processing 26/100: [dune.3.19.1, dune-configurator.3.19.1: extract] [ppx_here.v0.18~preview.130.36+326: extract] [ppx_inline_test.v0.18~preview.130.36+326: extract]
-> retrieved ppx_here.v0.18~preview.130.36+326  (cached)
Processing 26/100: [dune.3.19.1, dune-configurator.3.19.1: extract] [ppx_inline_test.v0.18~preview.130.36+326: extract]
Processing 27/100: [dune.3.19.1, dune-configurator.3.19.1: extract] [ppx_inline_test.v0.18~preview.130.36+326: extract] [ppx_optcomp.v0.18~preview.130.36+326: extract]
-> retrieved ppx_inline_test.v0.18~preview.130.36+326  (cached)
Processing 27/100: [dune.3.19.1, dune-configurator.3.19.1: extract] [ppx_optcomp.v0.18~preview.130.36+326: extract]
Processing 28/100: [dune.3.19.1, dune-configurator.3.19.1: extract] [ppx_optcomp.v0.18~preview.130.36+326: extract] [ppx_sexp_conv.v0.18~preview.130.36+326: extract]
-> retrieved ppx_optcomp.v0.18~preview.130.36+326  (cached)
Processing 28/100: [dune.3.19.1, dune-configurator.3.19.1: extract] [ppx_sexp_conv.v0.18~preview.130.36+326: extract]
Processing 29/100: [dune.3.19.1, dune-configurator.3.19.1: extract] [ppx_sexp_conv.v0.18~preview.130.36+326: extract] [ppx_shorthand.v0.18~preview.130.36+326: extract]
-> retrieved ppx_sexp_conv.v0.18~preview.130.36+326  (cached)
Processing 29/100: [dune.3.19.1, dune-configurator.3.19.1: extract] [ppx_shorthand.v0.18~preview.130.36+326: extract]
Processing 30/100: [dune.3.19.1, dune-configurator.3.19.1: extract] [ppx_shorthand.v0.18~preview.130.36+326: extract] [ppx_template.v0.18~preview.130.36+326: extract]
-> retrieved ppx_shorthand.v0.18~preview.130.36+326  (cached)
Processing 30/100: [dune.3.19.1, dune-configurator.3.19.1: extract] [ppx_template.v0.18~preview.130.36+326: extract]
Processing 31/100: [dune.3.19.1, dune-configurator.3.19.1: extract] [ppx_template.v0.18~preview.130.36+326: extract] [ppxlib.0.33.0+ox, ppxlib_ast.0.33.0+ox: extract]
-> retrieved ppx_template.v0.18~preview.130.36+326  (cached)
Processing 31/100: [dune.3.19.1, dune-configurator.3.19.1: extract] [ppxlib.0.33.0+ox, ppxlib_ast.0.33.0+ox: extract]
Processing 32/100: [dune.3.19.1, dune-configurator.3.19.1: extract] [ppxlib.0.33.0+ox, ppxlib_ast.0.33.0+ox: extract] [ppxlib_jane.v0.18~preview.130.36+326: extract]
-> retrieved ppxlib_jane.v0.18~preview.130.36+326  (cached)
Processing 32/100: [dune.3.19.1, dune-configurator.3.19.1: extract] [ppxlib.0.33.0+ox, ppxlib_ast.0.33.0+ox: extract]
Processing 33/100: [dune.3.19.1, dune-configurator.3.19.1: extract] [ppxlib.0.33.0+ox, ppxlib_ast.0.33.0+ox: extract] [sexplib0.v0.18~preview.130.36+326: extract]
-> retrieved ppxlib.0.33.0+ox, ppxlib_ast.0.33.0+ox  (cached)
Processing 33/100: [dune.3.19.1, dune-configurator.3.19.1: extract] [sexplib0.v0.18~preview.130.36+326: extract]
Processing 34/100: [dune.3.19.1, dune-configurator.3.19.1: extract] [sexplib0.v0.18~preview.130.36+326: extract] [stdio.v0.18~preview.130.36+326: extract]
-> retrieved sexplib0.v0.18~preview.130.36+326  (cached)
Processing 34/100: [dune.3.19.1, dune-configurator.3.19.1: extract] [stdio.v0.18~preview.130.36+326: extract]
Processing 35/100: [dune.3.19.1, dune-configurator.3.19.1: extract] [stdio.v0.18~preview.130.36+326: extract] [stdlib-shims.0.3.0: extract]
-> retrieved stdio.v0.18~preview.130.36+326  (cached)
Processing 35/100: [dune.3.19.1, dune-configurator.3.19.1: extract] [stdlib-shims.0.3.0: extract]
Processing 36/100: [dune.3.19.1, dune-configurator.3.19.1: extract] [stdlib-shims.0.3.0: extract] [time_now.v0.18~preview.130.36+326: extract]
-> retrieved stdlib-shims.0.3.0  (cached)
Processing 36/100: [dune.3.19.1, dune-configurator.3.19.1: extract] [time_now.v0.18~preview.130.36+326: extract]
-> retrieved time_now.v0.18~preview.130.36+326  (cached)
Processing 36/100: [dune.3.19.1, dune-configurator.3.19.1: extract]
-> retrieved dune.3.19.1, dune-configurator.3.19.1  (cached)
Processing 37/100: [dune: ocaml 71]
+ /home/opam/.opam/opam-init/hooks/sandbox.sh "build" "ocaml" "boot/bootstrap.ml" "-j" "71" (CWD=/home/opam/.opam/5.2.0+flambda2/.opam-switch/build/dune.3.19.1)
- ocamlc -output-complete-exe -w -24 -g -o .duneboot.exe -I boot -I +unix unix.cma boot/libs.ml boot/duneboot.ml
- ./.duneboot.exe -j 71
- cd _boot && /home/opam/.opam/5.2.0+flambda2/bin/ocamlopt.opt -c -g -no-alias-deps -w -49-6 -alert -unstable -I +unix -I +threads ocamlc_loc.mli
- File "otherlibs/ocamlc-loc/src/ocamlc_loc.mli", line 1, characters 4-9:
- Warning 53 [misplaced-attribute]: the "alert" attribute cannot appear in this context
- cd _boot && /home/opam/.opam/5.2.0+flambda2/bin/ocamlopt.opt -c -g -no-alias-deps -w -49-6 -alert -unstable -I +unix -I +threads stdune__Code_error.ml
- File "otherlibs/stdune/src/code_error.ml", line 29, characters 2-27:
- Alert unsafe_multidomain: Stdlib.Printexc.register_printer
- Use [Printexc.Safe.register_printer].
- cd _boot && /home/opam/.opam/5.2.0+flambda2/bin/ocamlopt.opt -c -g -no-alias-deps -w -49-6 -alert -unstable -I +unix -I +threads notty_unix.ml
- File "vendor/notty/src-unix/notty_unix.ml", line 38, characters 23-29:
- Alert unsafe_multidomain: Stdlib.Sys.signal
- Use [Sys.Safe.signal].
- 
- File "vendor/notty/src-unix/notty_unix.ml", line 39, characters 31-45:
- Alert unsafe_multidomain: Stdlib.Sys.set_signal
- Use [Sys.Safe.set_signal].
- cd _boot && /home/opam/.opam/5.2.0+flambda2/bin/ocamlopt.opt -c -g -no-alias-deps -w -49-6 -alert -unstable -I +unix -I +threads stdune__User_error.ml
- File "otherlibs/stdune/src/user_error.ml", line 17, characters 2-27:
- Alert unsafe_multidomain: Stdlib.Printexc.register_printer
- Use [Printexc.Safe.register_printer].
- cd _boot && /home/opam/.opam/5.2.0+flambda2/bin/ocamlopt.opt -c -g -no-alias-deps -w -49-6 -alert -unstable -I +unix -I +threads opamStd.ml
- File "vendor/opam/src/core/opamStd.ml", line 960, characters 10-24:
- Alert unsafe_multidomain: Stdlib.Sys.set_signal
- Use [Sys.Safe.set_signal].
- cd _boot && /home/opam/.opam/5.2.0+flambda2/bin/ocamlopt.opt -c -g -no-alias-deps -w -49-6 -alert -unstable -I +unix -I +threads dune_rpc_private__Conv.ml
- File "otherlibs/dune-rpc/private/conv.ml", line 48, characters 2-27:
- Alert unsafe_multidomain: Stdlib.Printexc.register_printer
- Use [Printexc.Safe.register_printer].
- cd _boot && /home/opam/.opam/5.2.0+flambda2/bin/ocamlopt.opt -c -g -no-alias-deps -w -49-6 -alert -unstable -I +unix -I +threads dune_rpc_private__Where.ml
- File "otherlibs/dune-rpc/private/where.ml", line 22, characters 2-27:
- Alert unsafe_multidomain: Stdlib.Printexc.register_printer
- Use [Printexc.Safe.register_printer].
- cd _boot && /home/opam/.opam/5.2.0+flambda2/bin/ocamlopt.opt -c -g -no-alias-deps -w -49-6 -alert -unstable -I +unix -I +threads dune_rpc_private__Registry.ml
- File "otherlibs/dune-rpc/private/registry.ml", line 67, characters 4-29:
- Alert unsafe_multidomain: Stdlib.Printexc.register_printer
- Use [Printexc.Safe.register_printer].
- cd _boot && /home/opam/.opam/5.2.0+flambda2/bin/ocamlopt.opt -c -g -no-alias-deps -w -49-6 -alert -unstable -I +unix -I +threads dune_rpc_private__Types.ml
- File "otherlibs/dune-rpc/private/types.ml", line 154, characters 6-31:
- Alert unsafe_multidomain: Stdlib.Printexc.register_printer
- Use [Printexc.Safe.register_printer].
- cd _boot && /home/opam/.opam/5.2.0+flambda2/bin/ocamlopt.opt -c -g -no-alias-deps -w -49-6 -alert -unstable -I +unix -I +threads dune_rpc_private__Versioned.ml
- File "otherlibs/dune-rpc/private/versioned.ml", line 23, characters 4-29:
- Alert unsafe_multidomain: Stdlib.Printexc.register_printer
- Use [Printexc.Safe.register_printer].
- cd _boot && /home/opam/.opam/5.2.0+flambda2/bin/ocamlopt.opt -c -g -no-alias-deps -w -49-6 -alert -unstable -I +unix -I +threads opamSystem.ml
- File "vendor/opam/src/core/opamSystem.ml", line 1248, characters 2-27:
- Alert unsafe_multidomain: Stdlib.Printexc.register_printer
- Use [Printexc.Safe.register_printer].
- 
- File "vendor/opam/src/core/opamSystem.ml", line 1264, characters 6-20:
- Alert unsafe_multidomain: Stdlib.Sys.set_signal
- Use [Sys.Safe.set_signal].
- cd _boot && /home/opam/.opam/5.2.0+flambda2/bin/ocamlopt.opt -c -g -no-alias-deps -w -49-6 -alert -unstable -I +unix -I +threads memo.ml
- File "src/memo/memo.ml", line 414, characters 2-27:
- Alert unsafe_multidomain: Stdlib.Printexc.register_printer
- Use [Printexc.Safe.register_printer].
- cd _boot && /home/opam/.opam/5.2.0+flambda2/bin/ocamlopt.opt -c -g -no-alias-deps -w -49-6 -alert -unstable -I +unix -I +threads dune_rpc_private.ml
- File "otherlibs/dune-rpc/private/dune_rpc_private.ml", line 200, characters 6-31:
- Alert unsafe_multidomain: Stdlib.Printexc.register_printer
- Use [Printexc.Safe.register_printer].
- cd _boot && /home/opam/.opam/5.2.0+flambda2/bin/ocamlopt.opt -c -g -no-alias-deps -w -49-6 -alert -unstable -I +unix -I +threads dune_action_plugin.mli
- File "otherlibs/dune-action-plugin/src/dune_action_plugin.mli", line 1, characters 4-9:
- Warning 53 [misplaced-attribute]: the "alert" attribute cannot appear in this context
- cd _boot && /home/opam/.opam/5.2.0+flambda2/bin/ocamlopt.opt -c -g -no-alias-deps -w -49-6 -alert -unstable -I +unix -I +threads dune_rpc_server.ml
- File "src/dune_rpc_server/dune_rpc_server.ml", line 15, characters 2-27:
- Alert unsafe_multidomain: Stdlib.Printexc.register_printer
- Use [Printexc.Safe.register_printer].
- cd _boot && /home/opam/.opam/5.2.0+flambda2/bin/ocamlopt.opt -c -g -no-alias-deps -w -49-6 -alert -unstable -I +unix -I +threads dune_engine__Scheduler.ml
- File "src/dune_engine/scheduler.ml", line 54, characters 4-29:
- Alert unsafe_multidomain: Stdlib.Printexc.register_printer
- Use [Printexc.Safe.register_printer].
- 
- File "src/dune_engine/scheduler.ml", line 632, characters 6-20:
- Alert unsafe_multidomain: Dune_engine__.Import.Sys.set_signal
- Use [Sys.Safe.set_signal].
- cd _boot && /home/opam/.opam/5.2.0+flambda2/bin/ocamlopt.opt -c -g -no-alias-deps -w -49-6 -alert -unstable -I +unix -I +threads opamPp.ml
- File "vendor/opam/src/format/opamPp.ml", line 64, characters 9-34:
- Alert unsafe_multidomain: Stdlib.Printexc.register_printer
- Use [Printexc.Safe.register_printer].
- cd _boot && /home/opam/.opam/5.2.0+flambda2/bin/ocamlopt.opt -c -g -no-alias-deps -w -49-6 -alert -unstable -I +unix -I +threads dune_tui.ml
- File "src/dune_tui/dune_tui.ml", line 14, characters 7-21:
- Alert unsafe_multidomain: Dune_tui__.Import.Sys.set_signal
- Use [Sys.Safe.set_signal].
- 
- File "src/dune_tui/dune_tui.ml", line 22, characters 12-22:
- Alert unsafe_multidomain: Dune_tui__.Import.Sys.signal
- Use [Sys.Safe.signal].
- 

Processing 37/100: [dune: ./_boot/dune.exe build]
+ /home/opam/.opam/opam-init/hooks/sandbox.sh "build" "./_boot/dune.exe" "build" "dune.install" "--release" "--profile" "dune-bootstrap" "-j" "71" (CWD=/home/opam/.opam/5.2.0+flambda2/.opam-switch/build/dune.3.19.1)
-> compiled  dune.3.19.1
-> installed dune.3.19.1
Processing 39/100: [basement: dune build]
Processing 40/100: [basement: dune build] [csexp: dune build]
Processing 41/100: [basement: dune build] [csexp: dune build] [jane-street-headers: dune build]
[ocaml-compiler-libs: patch] applying read_cma.patch
Processing 42/100: [basement: dune build] [csexp: dune build] [jane-street-headers: dune build] [ocaml-compiler-libs: dune build]
Processing 43/100: [basement: dune build] [csexp: dune build] [jane-street-headers: dune build] [ocaml-compiler-libs: dune build] [ocaml_intrinsics_kernel: dune build]
Processing 44/100: [basement: dune build] [csexp: dune build] [jane-street-headers: dune build] [ocaml-compiler-libs: dune build] [ocaml_intrinsics_kernel: dune build] [ppx_derivers: dune build]
Processing 45/100: [basement: dune build] [csexp: dune build] [jane-street-headers: dune build] [ocaml-compiler-libs: dune build] [ocaml_intrinsics_kernel: dune build] [ppx_derivers: dune build] [stdlib-shims: dune build]
+ /home/opam/.opam/opam-init/hooks/sandbox.sh "build" "dune" "build" "-p" "jane-street-headers" "-j" "71" (CWD=/home/opam/.opam/5.2.0+flambda2/.opam-switch/build/jane-street-headers.v0.18~preview.130.36+326)
-> compiled  jane-street-headers.v0.18~preview.130.36+326
Processing 45/100: [basement: dune build] [csexp: dune build] [ocaml-compiler-libs: dune build] [ocaml_intrinsics_kernel: dune build] [ppx_derivers: dune build] [stdlib-shims: dune build]
-> installed jane-street-headers.v0.18~preview.130.36+326
Processing 46/100: [basement: dune build] [csexp: dune build] [ocaml-compiler-libs: dune build] [ocaml_intrinsics_kernel: dune build] [ppx_derivers: dune build] [stdlib-shims: dune build]
+ /home/opam/.opam/opam-init/hooks/sandbox.sh "build" "dune" "build" "-p" "ppx_derivers" "-j" "71" (CWD=/home/opam/.opam/5.2.0+flambda2/.opam-switch/build/ppx_derivers.1.2.1)
-> compiled  ppx_derivers.1.2.1
Processing 46/100: [basement: dune build] [csexp: dune build] [ocaml-compiler-libs: dune build] [ocaml_intrinsics_kernel: dune build] [stdlib-shims: dune build]
-> installed ppx_derivers.1.2.1
Processing 47/100: [basement: dune build] [csexp: dune build] [ocaml-compiler-libs: dune build] [ocaml_intrinsics_kernel: dune build] [stdlib-shims: dune build]
+ /home/opam/.opam/opam-init/hooks/sandbox.sh "build" "dune" "build" "-p" "ocaml_intrinsics_kernel" "-j" "71" (CWD=/home/opam/.opam/5.2.0+flambda2/.opam-switch/build/ocaml_intrinsics_kernel.v0.18~preview.130.36+326)
-> compiled  ocaml_intrinsics_kernel.v0.18~preview.130.36+326
Processing 47/100: [basement: dune build] [csexp: dune build] [ocaml-compiler-libs: dune build] [stdlib-shims: dune build]
-> installed ocaml_intrinsics_kernel.v0.18~preview.130.36+326
Processing 48/100: [basement: dune build] [csexp: dune build] [ocaml-compiler-libs: dune build] [stdlib-shims: dune build]
+ /home/opam/.opam/opam-init/hooks/sandbox.sh "build" "dune" "build" "-p" "csexp" "-j" "71" "@install" (CWD=/home/opam/.opam/5.2.0+flambda2/.opam-switch/build/csexp.1.5.2)
- (cd _build/default && /home/opam/.opam/5.2.0+flambda2/bin/ocamlc.opt -w -40 -g -bin-annot -bin-annot-occurrences -I src/.csexp.objs/byte -intf-suffix .ml -no-alias-deps -o src/.csexp.objs/byte/csexp.cmo -c -impl src/csexp.ml)
- File "src/csexp.ml", line 236, characters 7-14:
- 236 |     [@@inlined always]
-              ^^^^^^^
- Warning 53 [misplaced-attribute]: the "inlined" attribute cannot appear in this context
- (cd _build/default && /home/opam/.opam/5.2.0+flambda2/bin/ocamlopt.opt -w -40 -g -I src/.csexp.objs/byte -I src/.csexp.objs/native -intf-suffix .ml -no-alias-deps -o src/.csexp.objs/native/csexp.cmx -c -impl src/csexp.ml)
- File "src/csexp.ml", line 236, characters 7-14:
- 236 |     [@@inlined always]
-              ^^^^^^^
- Warning 53 [misplaced-attribute]: the "inlined" attribute cannot appear in this context
-> compiled  csexp.1.5.2
Processing 48/100: [basement: dune build] [ocaml-compiler-libs: dune build] [stdlib-shims: dune build]
-> installed csexp.1.5.2
Processing 49/100: [basement: dune build] [ocaml-compiler-libs: dune build] [stdlib-shims: dune build]
Processing 50/100: [basement: dune build] [dune-configurator: rm] [ocaml-compiler-libs: dune build] [stdlib-shims: dune build]
+ /home/opam/.opam/opam-init/hooks/sandbox.sh "build" "dune" "build" "-p" "basement" "-j" "71" (CWD=/home/opam/.opam/5.2.0+flambda2/.opam-switch/build/basement.v0.18~preview.130.36+326)
- (cd _build/default && /home/opam/.opam/5.2.0+flambda2/bin/ocamlc.opt -w -40 -g -bin-annot -bin-annot-occurrences -I src/.basement.objs/byte -no-alias-deps -open Basement__ -o src/.basement.objs/byte/basement.cmo -c -impl src/basement.ml)
- File "src/basement.ml", line 10, characters 30-50:
- 10 | module Stdlib_shim_upstream = Stdlib_shim_upstream
-                                    ^^^^^^^^^^^^^^^^^^^^
- Warning 49 [no-cmi-file]: no cmi file was found in path for module Stdlib_shim_upstream
- (cd _build/default && /home/opam/.opam/5.2.0+flambda2/bin/ocamlopt.opt -w -40 -g -O3 -flambda2-inline-max-depth 10 -I src/.basement.objs/byte -I src/.basement.objs/native -intf-suffix .ml -no-alias-deps -open Basement__ -o src/.basement.objs/native/basement.cmx -c -impl src/basement.ml)
- File "src/basement.ml", line 10, characters 30-50:
- 10 | module Stdlib_shim_upstream = Stdlib_shim_upstream
-                                    ^^^^^^^^^^^^^^^^^^^^
- Warning 49 [no-cmi-file]: no cmi file was found in path for module Stdlib_shim_upstream
-> compiled  basement.v0.18~preview.130.36+326
Processing 50/100: [dune-configurator: rm] [ocaml-compiler-libs: dune build] [stdlib-shims: dune build]
-> installed basement.v0.18~preview.130.36+326
Processing 51/100: [dune-configurator: rm] [ocaml-compiler-libs: dune build] [stdlib-shims: dune build]
Processing 52/100: [dune-configurator: rm] [ocaml-compiler-libs: dune build] [sexplib0: dune build] [stdlib-shims: dune build]
+ /home/opam/.opam/opam-init/hooks/sandbox.sh "build" "dune" "build" "-p" "stdlib-shims" "-j" "71" (CWD=/home/opam/.opam/5.2.0+flambda2/.opam-switch/build/stdlib-shims.0.3.0)
-> compiled  stdlib-shims.0.3.0
Processing 52/100: [dune-configurator: rm] [ocaml-compiler-libs: dune build] [sexplib0: dune build]
-> installed stdlib-shims.0.3.0
Processing 53/100: [dune-configurator: rm] [ocaml-compiler-libs: dune build] [sexplib0: dune build]
+ /home/opam/.opam/opam-init/hooks/sandbox.sh "build" "rm" "-rf" "vendor/csexp" (CWD=/home/opam/.opam/5.2.0+flambda2/.opam-switch/build/dune-configurator.3.19.1)
+ /home/opam/.opam/opam-init/hooks/sandbox.sh "build" "rm" "-rf" "vendor/pp" (CWD=/home/opam/.opam/5.2.0+flambda2/.opam-switch/build/dune-configurator.3.19.1)
Processing 53/100: [dune-configurator: dune build] [ocaml-compiler-libs: dune build] [sexplib0: dune build]
+ /home/opam/.opam/opam-init/hooks/sandbox.sh "build" "dune" "build" "-p" "ocaml-compiler-libs" "-j" "71" (CWD=/home/opam/.opam/5.2.0+flambda2/.opam-switch/build/ocaml-compiler-libs.v0.17.0+ox)
- (cd _build/default && /home/opam/.opam/5.2.0+flambda2/bin/ocamlc.opt -w -40 -safe-string -g -bin-annot -bin-annot-occurrences -I src/ocaml_toplevel/.ocaml_toplevel.objs/byte -I /home/opam/.opam/5.2.0+flambda2/lib/ocaml/compiler-libs -no-alias-deps -o src/ocaml_toplevel/.ocaml_toplevel.objs/byte/ocaml_toplevel.cmo -c -impl src/ocaml_toplevel/ocaml_toplevel.ml)
- File "src/ocaml_toplevel/ocaml_toplevel.ml", line 4, characters 21-30:
- 4 | module Topcommon   = Topcommon
-                          ^^^^^^^^^
- Warning 49 [no-cmi-file]: no cmi file was found in path for module Topcommon
- 
- File "src/ocaml_toplevel/ocaml_toplevel.ml", line 6, characters 21-28:
- 6 | module Topeval     = Topeval
-                          ^^^^^^^
- Warning 49 [no-cmi-file]: no cmi file was found in path for module Topeval
- 
- File "src/ocaml_toplevel/ocaml_toplevel.ml", line 9, characters 21-32:
- 9 | module Topprinters = Topprinters
-                          ^^^^^^^^^^^
- Warning 49 [no-cmi-file]: no cmi file was found in path for module Topprinters
- (cd _build/default && /home/opam/.opam/5.2.0+flambda2/bin/ocamlopt.opt -w -40 -safe-string -g -I src/ocaml_toplevel/.ocaml_toplevel.objs/byte -I src/ocaml_toplevel/.ocaml_toplevel.objs/native -I /home/opam/.opam/5.2.0+flambda2/lib/ocaml/compiler-libs -intf-suffix .ml -no-alias-deps -o src/ocaml_toplevel/.ocaml_toplevel.objs/native/ocaml_toplevel.cmx -c -impl src/ocaml_toplevel/ocaml_toplevel.ml)
- File "src/ocaml_toplevel/ocaml_toplevel.ml", line 4, characters 21-30:
- 4 | module Topcommon   = Topcommon
-                          ^^^^^^^^^
- Warning 49 [no-cmi-file]: no cmi file was found in path for module Topcommon
- 
- File "src/ocaml_toplevel/ocaml_toplevel.ml", line 6, characters 21-28:
- 6 | module Topeval     = Topeval
-                          ^^^^^^^
- Warning 49 [no-cmi-file]: no cmi file was found in path for module Topeval
- 
- File "src/ocaml_toplevel/ocaml_toplevel.ml", line 9, characters 21-32:
- 9 | module Topprinters = Topprinters
-                          ^^^^^^^^^^^
- Warning 49 [no-cmi-file]: no cmi file was found in path for module Topprinters
- (cd _build/default && /home/opam/.opam/5.2.0+flambda2/bin/ocamlc.opt -w -40 -safe-string -g -bin-annot -bin-annot-occurrences -I src/ocaml_optcomp/.ocaml_optcomp.objs/byte -I /home/opam/.opam/5.2.0+flambda2/lib/ocaml/compiler-libs -no-alias-deps -o src/ocaml_optcomp/.ocaml_optcomp.objs/byte/ocaml_optcomp.cmo -c -impl src/ocaml_optcomp/ocaml_optcomp.ml)
- File "src/ocaml_optcomp/ocaml_optcomp.ml", line 438, characters 68-95:
- 438 | module Oxcaml_utils__File_sections                                = Oxcaml_utils__File_sections
-                                                                           ^^^^^^^^^^^^^^^^^^^^^^^^^^^
- Warning 49 [no-cmi-file]: no cmi file was found in path for module Oxcaml_utils__File_sections
- 
- File "src/ocaml_optcomp/ocaml_optcomp.ml", line 439, characters 68-85:
- 439 | module Oxcaml_utils__Lru                                          = Oxcaml_utils__Lru
-                                                                           ^^^^^^^^^^^^^^^^^
- Warning 49 [no-cmi-file]: no cmi file was found in path for module Oxcaml_utils__Lru
- 
- File "src/ocaml_optcomp/ocaml_optcomp.ml", line 474, characters 68-84:
- 474 | module Relocation_table                                           = Relocation_table
-                                                                           ^^^^^^^^^^^^^^^^
- Warning 49 [no-cmi-file]: no cmi file was found in path for module Relocation_table
- 
- File "src/ocaml_optcomp/ocaml_optcomp.ml", line 487, characters 68-80:
- 487 | module Symbol_entry                                               = Symbol_entry
-                                                                           ^^^^^^^^^^^^
- Warning 49 [no-cmi-file]: no cmi file was found in path for module Symbol_entry
- (cd _build/default && /home/opam/.opam/5.2.0+flambda2/bin/ocamlopt.opt -w -40 -safe-string -g -I src/ocaml_optcomp/.ocaml_optcomp.objs/byte -I src/ocaml_optcomp/.ocaml_optcomp.objs/native -I /home/opam/.opam/5.2.0+flambda2/lib/ocaml/compiler-libs -intf-suffix .ml -no-alias-deps -o src/ocaml_optcomp/.ocaml_optcomp.objs/native/ocaml_optcomp.cmx -c -impl src/ocaml_optcomp/ocaml_optcomp.ml)
- File "src/ocaml_optcomp/ocaml_optcomp.ml", line 438, characters 68-95:
- 438 | module Oxcaml_utils__File_sections                                = Oxcaml_utils__File_sections
-                                                                           ^^^^^^^^^^^^^^^^^^^^^^^^^^^
- Warning 49 [no-cmi-file]: no cmi file was found in path for module Oxcaml_utils__File_sections
- 
- File "src/ocaml_optcomp/ocaml_optcomp.ml", line 439, characters 68-85:
- 439 | module Oxcaml_utils__Lru                                          = Oxcaml_utils__Lru
-                                                                           ^^^^^^^^^^^^^^^^^
- Warning 49 [no-cmi-file]: no cmi file was found in path for module Oxcaml_utils__Lru
- 
- File "src/ocaml_optcomp/ocaml_optcomp.ml", line 474, characters 68-84:
- 474 | module Relocation_table                                           = Relocation_table
-                                                                           ^^^^^^^^^^^^^^^^
- Warning 49 [no-cmi-file]: no cmi file was found in path for module Relocation_table
- 
- File "src/ocaml_optcomp/ocaml_optcomp.ml", line 487, characters 68-80:
- 487 | module Symbol_entry                                               = Symbol_entry
-                                                                           ^^^^^^^^^^^^
- Warning 49 [no-cmi-file]: no cmi file was found in path for module Symbol_entry
-> compiled  ocaml-compiler-libs.v0.17.0+ox
Processing 53/100: [dune-configurator: dune build] [sexplib0: dune build]
-> installed ocaml-compiler-libs.v0.17.0+ox
Processing 54/100: [dune-configurator: dune build] [sexplib0: dune build]
+ /home/opam/.opam/opam-init/hooks/sandbox.sh "build" "dune" "build" "-p" "sexplib0" "-j" "71" (CWD=/home/opam/.opam/5.2.0+flambda2/.opam-switch/build/sexplib0.v0.18~preview.130.36+326)
-> compiled  sexplib0.v0.18~preview.130.36+326
Processing 54/100: [dune-configurator: dune build]
-> installed sexplib0.v0.18~preview.130.36+326
Processing 55/100: [dune-configurator: dune build]
[ppxlib_ast: patch] applying ppxlib+ast+ast.ml.patch
[ppxlib_ast: patch] applying ppxlib+ast+ast_helper_lite.ml.patch
[ppxlib_ast: patch] applying ppxlib+ast+ast_helper_lite.mli.patch
[ppxlib_ast: patch] applying ppxlib+ast+location_error.ml.patch
[ppxlib_ast: patch] applying ppxlib+ast+location_error.mli.patch
[ppxlib_ast: patch] applying ppxlib+ast+supported_version+supported_version.ml.patch
[ppxlib_ast: patch] applying ppxlib+ast+versions.ml.patch
[ppxlib_ast: patch] applying ppxlib+ast+versions.mli.patch
[ppxlib_ast: patch] applying ppxlib+astlib+ast_414.ml.patch
[ppxlib_ast: patch] applying ppxlib+astlib+ast_500.ml.patch
[ppxlib_ast: patch] applying ppxlib+astlib+ast_999.ml.patch
[ppxlib_ast: patch] applying ppxlib+astlib+ast_metadata.mli.patch
[ppxlib_ast: patch] applying ppxlib+astlib+astlib.ml.patch
[ppxlib_ast: patch] applying ppxlib+astlib+cinaps+astlib_cinaps_helpers.ml.patch
[ppxlib_ast: patch] applying ppxlib+astlib+config+gen.ml.patch
[ppxlib_ast: patch] applying ppxlib+astlib+migrate_500_999.ml.patch
[ppxlib_ast: patch] applying ppxlib+astlib+migrate_999_500.ml.patch
[ppxlib_ast: patch] applying ppxlib+astlib+parse.mli.patch
[ppxlib_ast: patch] applying ppxlib+astlib+pprintast.ml.patch
[ppxlib_ast: patch] applying ppxlib+astlib+pprintast.mli.patch
[ppxlib_ast: patch] applying ppxlib+astlib+stdlib0.ml.patch
[ppxlib_ast: patch] applying ppxlib+stdppx+stdppx.ml.patch
[ppxlib_ast: patch] applying dune.patch
Processing 56/100: [dune-configurator: dune build] [ppxlib_ast: bash]
+ /home/opam/.opam/opam-init/hooks/sandbox.sh "build" "bash" "./cleanup.sh" (CWD=/home/opam/.opam/5.2.0+flambda2/.opam-switch/build/ppxlib_ast.0.33.0+ox)
Processing 56/100: [dune-configurator: dune build] [ppxlib_ast: dune build]
+ /home/opam/.opam/opam-init/hooks/sandbox.sh "build" "dune" "build" "-p" "dune-configurator" "-j" "71" "@install" (CWD=/home/opam/.opam/5.2.0+flambda2/.opam-switch/build/dune-configurator.3.19.1)
-> compiled  dune-configurator.3.19.1
Processing 56/100: [ppxlib_ast: dune build]
-> installed dune-configurator.3.19.1
Processing 57/100: [ppxlib_ast: dune build]
+ /home/opam/.opam/opam-init/hooks/sandbox.sh "build" "dune" "build" "-p" "ppxlib_ast" "-j" "71" "@install" (CWD=/home/opam/.opam/5.2.0+flambda2/.opam-switch/build/ppxlib_ast.0.33.0+ox)
-> compiled  ppxlib_ast.0.33.0+ox
-> installed ppxlib_ast.0.33.0+ox
Processing 59/100: [ppxlib_jane: dune build]
+ /home/opam/.opam/opam-init/hooks/sandbox.sh "build" "dune" "build" "-p" "ppxlib_jane" "-j" "71" (CWD=/home/opam/.opam/5.2.0+flambda2/.opam-switch/build/ppxlib_jane.v0.18~preview.130.36+326)
-> compiled  ppxlib_jane.v0.18~preview.130.36+326
-> installed ppxlib_jane.v0.18~preview.130.36+326
[ppxlib: patch] applying ppxlib+doc+writing_ppxs.mld.patch
[ppxlib: patch] applying ppxlib+metaquot+ppxlib_metaquot.ml.patch
[ppxlib: patch] applying ppxlib+runner_as_ppx+ppxlib_runner_as_ppx.ml.patch
[ppxlib: patch] applying ppxlib+src+ast_builder.ml.patch
[ppxlib: patch] applying ppxlib+src+ast_builder.mli.patch
[ppxlib: patch] applying ppxlib+src+ast_builder_intf.ml.patch
[ppxlib: patch] applying ppxlib+src+ast_pattern.ml.patch
[ppxlib: patch] applying ppxlib+src+ast_pattern.mli.patch
[ppxlib: patch] applying ppxlib+src+ast_traverse.ml.patch
[ppxlib: patch] applying ppxlib+src+attribute.ml.patch
[ppxlib: patch] applying ppxlib+src+attribute.mli.patch
[ppxlib: patch] applying ppxlib+src+cinaps+ppxlib_cinaps_helpers.ml.patch
[ppxlib: patch] applying ppxlib+src+code_matcher.ml.patch
[ppxlib: patch] applying ppxlib+src+code_matcher.mli.patch
[ppxlib: patch] applying ppxlib+src+common.ml.patch
[ppxlib: patch] applying ppxlib+src+common.mli.patch
[ppxlib: patch] applying ppxlib+src+context_free.ml.patch
[ppxlib: patch] applying ppxlib+src+context_free.mli.patch
[ppxlib: patch] applying ppxlib+src+deriving.ml.patch
[ppxlib: patch] applying ppxlib+src+deriving.mli.patch
[ppxlib: patch] applying ppxlib+src+driver.ml.patch
[ppxlib: patch] applying ppxlib+src+driver.mli.patch
[ppxlib: patch] applying ppxlib+src+gen+gen_ast_builder.ml.patch
[ppxlib: patch] applying ppxlib+src+gen+gen_ast_pattern.ml.patch
[ppxlib: patch] applying ppxlib+src+gen+import.ml.patch
[ppxlib: patch] applying ppxlib+src+ignore_unused_warning.ml.patch
[ppxlib: patch] applying ppxlib+src+location.ml.patch
[ppxlib: patch] applying ppxlib+src+location.mli.patch
[ppxlib: patch] applying ppxlib+src+name.ml.patch
[ppxlib: patch] applying ppxlib+src+utils.mli.patch
[ppxlib: patch] applying ppxlib+traverse+ppxlib_traverse.ml.patch
[ppxlib: patch] applying dune.patch
[ppxlib: patch] applying location_check.ml.patch
[ppxlib: patch] applying utils.ml.patch
Processing 61/100: [ppxlib: rm ast]
+ /home/opam/.opam/opam-init/hooks/sandbox.sh "build" "rm" "-rf" "ast" "astlib" "stdppx" "traverse_builtins" (CWD=/home/opam/.opam/5.2.0+flambda2/.opam-switch/build/ppxlib.0.33.0+ox)
Processing 61/100: [ppxlib: dune build]
+ /home/opam/.opam/opam-init/hooks/sandbox.sh "build" "dune" "build" "-p" "ppxlib" "-j" "71" "@install" (CWD=/home/opam/.opam/5.2.0+flambda2/.opam-switch/build/ppxlib.0.33.0+ox)
- (cd _build/default && /home/opam/.opam/5.2.0+flambda2/bin/ocamlopt.opt -w -40 -safe-string -g -I src/gen/.gen_ast_pattern.eobjs/byte -I src/gen/.gen_ast_pattern.eobjs/native -I /home/opam/.opam/5.2.0+flambda2/lib/ppxlib_ast/ast -I /home/opam/.opam/5.2.0+flambda2/lib/ppxlib_ast/astlib -I /home/opam/.opam/5.2.0+flambda2/lib/ppxlib_ast/stdppx -I /home/opam/.opam/5.2.0+flambda2/lib/ppxlib_ast/traverse_builtins -I /home/opam/.opam/5.2.0+flambda2/lib/ppxlib_jane -I /home/opam/.opam/5.2.0+flambda2/lib/stdlib-shims -I shims/ast/.ppxlib_ast.objs/byte -I shims/ast/.ppxlib_ast.objs/native -I shims/astlib/.astlib.objs/byte -I shims/astlib/.astlib.objs/native -I shims/stdppx/.stdppx.objs/byte -I shims/stdppx/.stdppx.objs/native -I shims/traverse_builtins/.ppxlib_traverse_builtins.objs/byte -I shims/traverse_builtins/.ppxlib_traverse_builtins.objs/native -intf-suffix .ml -no-alias-deps -open Dune__exe -o src/gen/.gen_ast_pattern.eobjs/native/dune__exe__Import.cmx -c -impl src/gen/import.ml)
- File "_none_", line 1:
- Warning 58 [no-cmx-file]: no cmx file was found in path for module Location, and its interface was not compiled with -opaque
- 
- File "_none_", line 1:
- Warning 58 [no-cmx-file]: no cmx file was found in path for module Longident, and its interface was not compiled with -opaque
- (cd _build/default && /home/opam/.opam/5.2.0+flambda2/bin/ocamlopt.opt -w -40 -safe-string -g -I src/gen/.gen_ast_pattern.eobjs/byte -I src/gen/.gen_ast_pattern.eobjs/native -I /home/opam/.opam/5.2.0+flambda2/lib/ppxlib_ast/ast -I /home/opam/.opam/5.2.0+flambda2/lib/ppxlib_ast/astlib -I /home/opam/.opam/5.2.0+flambda2/lib/ppxlib_ast/stdppx -I /home/opam/.opam/5.2.0+flambda2/lib/ppxlib_ast/traverse_builtins -I /home/opam/.opam/5.2.0+flambda2/lib/ppxlib_jane -I /home/opam/.opam/5.2.0+flambda2/lib/stdlib-shims -I shims/ast/.ppxlib_ast.objs/byte -I shims/ast/.ppxlib_ast.objs/native -I shims/astlib/.astlib.objs/byte -I shims/astlib/.astlib.objs/native -I shims/stdppx/.stdppx.objs/byte -I shims/stdppx/.stdppx.objs/native -I shims/traverse_builtins/.ppxlib_traverse_builtins.objs/byte -I shims/traverse_builtins/.ppxlib_traverse_builtins.objs/native -intf-suffix .ml -no-alias-deps -open Dune__exe -o src/gen/.gen_ast_pattern.eobjs/native/dune__exe__Gen_ast_builder.cmx -c -impl src/gen/gen_ast_builder.ml)
- File "_none_", line 1:
- Warning 58 [no-cmx-file]: no cmx file was found in path for module Location, and its interface was not compiled with -opaque
- (cd _build/default && /home/opam/.opam/5.2.0+flambda2/bin/ocamlopt.opt -w -40 -safe-string -g -I src/gen/.gen_ast_pattern.eobjs/byte -I src/gen/.gen_ast_pattern.eobjs/native -I /home/opam/.opam/5.2.0+flambda2/lib/ppxlib_ast/ast -I /home/opam/.opam/5.2.0+flambda2/lib/ppxlib_ast/astlib -I /home/opam/.opam/5.2.0+flambda2/lib/ppxlib_ast/stdppx -I /home/opam/.opam/5.2.0+flambda2/lib/ppxlib_ast/traverse_builtins -I /home/opam/.opam/5.2.0+flambda2/lib/ppxlib_jane -I /home/opam/.opam/5.2.0+flambda2/lib/stdlib-shims -I shims/ast/.ppxlib_ast.objs/byte -I shims/ast/.ppxlib_ast.objs/native -I shims/astlib/.astlib.objs/byte -I shims/astlib/.astlib.objs/native -I shims/stdppx/.stdppx.objs/byte -I shims/stdppx/.stdppx.objs/native -I shims/traverse_builtins/.ppxlib_traverse_builtins.objs/byte -I shims/traverse_builtins/.ppxlib_traverse_builtins.objs/native -intf-suffix .ml -no-alias-deps -open Dune__exe -o src/gen/.gen_ast_pattern.eobjs/native/dune__exe__Gen_ast_pattern.cmx -c -impl src/gen/gen_ast_pattern.ml)
- File "_none_", line 1:
- Warning 58 [no-cmx-file]: no cmx file was found in path for module Location, and its interface was not compiled with -opaque
- (cd _build/default && /home/opam/.opam/5.2.0+flambda2/bin/ocamlc.opt -w -40 -safe-string -open Ocaml_shadow -g -bin-annot -bin-annot-occurrences -I src/.ppxlib.objs/byte -I /home/opam/.opam/5.2.0+flambda2/lib/ocaml-compiler-libs/common -I /home/opam/.opam/5.2.0+flambda2/lib/ocaml-compiler-libs/shadow -I /home/opam/.opam/5.2.0+flambda2/lib/ocaml/compiler-libs -I /home/opam/.opam/5.2.0+flambda2/lib/ppx_derivers -I /home/opam/.opam/5.2.0+flambda2/lib/ppxlib_ast/ast -I /home/opam/.opam/5.2.0+flambda2/lib/ppxlib_ast/astlib -I /home/opam/.opam/5.2.0+flambda2/lib/ppxlib_ast/stdppx -I /home/opam/.opam/5.2.0+flambda2/lib/ppxlib_ast/traverse_builtins -I /home/opam/.opam/5.2.0+flambda2/lib/ppxlib_jane -I /home/opam/.opam/5.2.0+flambda2/lib/sexplib0 -I /home/opam/.opam/5.2.0+flambda2/lib/stdlib-shims -I print-diff/.ppxlib_print_diff.objs/byte -I shims/ast/.ppxlib_ast.objs/byte -I shims/astlib/.astlib.objs/byte -I shims/stdppx/.stdppx.objs/byte -I shims/traverse_builtins/.ppxlib_traverse_builtins.objs/byte -no-alias-deps -open Ppxlib__ -o src/.ppxlib.objs/byte/ppxlib__Ast_pattern_generated.cmo -c -impl src/ast_pattern_generated.ml)
- File "src/ast_pattern_generated.ml", line 1584, characters 9-10:
- 1584 |        | _ -> fail loc "Modality")
-                 ^
- Warning 11 [redundant-case]: this match case is unused.
- 
- File "src/ast_pattern_generated.ml", line 1591, characters 9-10:
- 1591 |        | _ -> fail loc "Mode")
-                 ^
- Warning 11 [redundant-case]: this match case is unused.
- (cd _build/default && /home/opam/.opam/5.2.0+flambda2/bin/ocamlopt.opt -w -40 -safe-string -open Ocaml_shadow -g -I src/.ppxlib.objs/byte -I src/.ppxlib.objs/native -I /home/opam/.opam/5.2.0+flambda2/lib/ocaml-compiler-libs/common -I /home/opam/.opam/5.2.0+flambda2/lib/ocaml-compiler-libs/shadow -I /home/opam/.opam/5.2.0+flambda2/lib/ocaml/compiler-libs -I /home/opam/.opam/5.2.0+flambda2/lib/ppx_derivers -I /home/opam/.opam/5.2.0+flambda2/lib/ppxlib_ast/ast -I /home/opam/.opam/5.2.0+flambda2/lib/ppxlib_ast/astlib -I /home/opam/.opam/5.2.0+flambda2/lib/ppxlib_ast/stdppx -I /home/opam/.opam/5.2.0+flambda2/lib/ppxlib_ast/traverse_builtins -I /home/opam/.opam/5.2.0+flambda2/lib/ppxlib_jane -I /home/opam/.opam/5.2.0+flambda2/lib/sexplib0 -I /home/opam/.opam/5.2.0+flambda2/lib/stdlib-shims -I print-diff/.ppxlib_print_diff.objs/byte -I print-diff/.ppxlib_print_diff.objs/native -I shims/ast/.ppxlib_ast.objs/byte -I shims/ast/.ppxlib_ast.objs/native -I shims/astlib/.astlib.objs/byte -I shims/astlib/.astlib.objs/native -I shims/stdppx/.stdppx.objs/byte -I shims/stdppx/.stdppx.objs/native -I shims/traverse_builtins/.ppxlib_traverse_builtins.objs/byte -I shims/traverse_builtins/.ppxlib_traverse_builtins.objs/native -intf-suffix .ml -no-alias-deps -open Ppxlib__ -o src/.ppxlib.objs/native/ppxlib__Ast_pattern_generated.cmx -c -impl src/ast_pattern_generated.ml)
- File "src/ast_pattern_generated.ml", line 1584, characters 9-10:
- 1584 |        | _ -> fail loc "Modality")
-                 ^
- Warning 11 [redundant-case]: this match case is unused.
- 
- File "src/ast_pattern_generated.ml", line 1591, characters 9-10:
- 1591 |        | _ -> fail loc "Mode")
-                 ^
- Warning 11 [redundant-case]: this match case is unused.
- (cd _build/default && /home/opam/.opam/5.2.0+flambda2/bin/ocamlopt.opt -w -40 -safe-string -g -I metaquot/.ppxlib_metaquot.objs/byte -I metaquot/.ppxlib_metaquot.objs/native -I /home/opam/.opam/5.2.0+flambda2/lib/ppxlib_ast/ast -I /home/opam/.opam/5.2.0+flambda2/lib/ppxlib_ast/astlib -I /home/opam/.opam/5.2.0+flambda2/lib/ppxlib_ast/traverse_builtins -I metaquot_lifters/.ppxlib_metaquot_lifters.objs/byte -I metaquot_lifters/.ppxlib_metaquot_lifters.objs/native -I shims/ast/.ppxlib_ast.objs/byte -I shims/ast/.ppxlib_ast.objs/native -I shims/astlib/.astlib.objs/byte -I shims/astlib/.astlib.objs/native -I shims/traverse_builtins/.ppxlib_traverse_builtins.objs/byte -I shims/traverse_builtins/.ppxlib_traverse_builtins.objs/native -I src/.ppxlib.objs/byte -I src/.ppxlib.objs/native -intf-suffix .ml -no-alias-deps -o metaquot/.ppxlib_metaquot.objs/native/ppxlib_metaquot.cmx -c -impl metaquot/ppxlib_metaquot.ml)
- File "_none_", line 1:
- Warning 58 [no-cmx-file]: no cmx file was found in path for module Ppxlib_jane__Shim, and its interface was not compiled with -opaque
- (cd _build/default && /home/opam/.opam/5.2.0+flambda2/bin/ocamlopt.opt -w -40 -safe-string -g -I traverse/.ppxlib_traverse.objs/byte -I traverse/.ppxlib_traverse.objs/native -I /home/opam/.opam/5.2.0+flambda2/lib/ppxlib_ast/ast -I /home/opam/.opam/5.2.0+flambda2/lib/ppxlib_ast/stdppx -I /home/opam/.opam/5.2.0+flambda2/lib/ppxlib_ast/traverse_builtins -I /home/opam/.opam/5.2.0+flambda2/lib/ppxlib_jane -I /home/opam/.opam/5.2.0+flambda2/lib/stdlib-shims -I shims/ast/.ppxlib_ast.objs/byte -I shims/ast/.ppxlib_ast.objs/native -I shims/stdppx/.stdppx.objs/byte -I shims/stdppx/.stdppx.objs/native -I shims/traverse_builtins/.ppxlib_traverse_builtins.objs/byte -I shims/traverse_builtins/.ppxlib_traverse_builtins.objs/native -I src/.ppxlib.objs/byte -I src/.ppxlib.objs/native -intf-suffix .ml -no-alias-deps -o traverse/.ppxlib_traverse.objs/native/ppxlib_traverse.cmx -c -impl traverse/ppxlib_traverse.pp.ml)
- File "_none_", line 1:
- Warning 58 [no-cmx-file]: no cmx file was found in path for module Astlib__Location, and its interface was not compiled with -opaque
-> compiled  ppxlib.0.33.0+ox
-> installed ppxlib.0.33.0+ox
Processing 63/100: [ppx_cold: dune build]
Processing 64/100: [ppx_cold: dune build] [ppx_compare: dune build]
Processing 65/100: [ppx_cold: dune build] [ppx_compare: dune build] [ppx_enumerate: dune build]
Processing 66/100: [ppx_cold: dune build] [ppx_compare: dune build] [ppx_enumerate: dune build] [ppx_globalize: dune build]
Processing 67/100: [ppx_cold: dune build] [ppx_compare: dune build] [ppx_enumerate: dune build] [ppx_globalize: dune build] [ppx_helpers: dune build]
Processing 68/100: [ppx_cold: dune build] [ppx_compare: dune build] [ppx_enumerate: dune build] [ppx_globalize: dune build] [ppx_helpers: dune build] [ppx_shorthand: dune build]
Processing 69/100: [ppx_cold: dune build] [ppx_compare: dune build] [ppx_enumerate: dune build] [ppx_globalize: dune build] [ppx_helpers: dune build] [ppx_shorthand: dune build] [ppx_template: dune build]
+ /home/opam/.opam/opam-init/hooks/sandbox.sh "build" "dune" "build" "-p" "ppx_helpers" "-j" "71" (CWD=/home/opam/.opam/5.2.0+flambda2/.opam-switch/build/ppx_helpers.v0.18~preview.130.36+326)
-> compiled  ppx_helpers.v0.18~preview.130.36+326
Processing 69/100: [ppx_cold: dune build] [ppx_compare: dune build] [ppx_enumerate: dune build] [ppx_globalize: dune build] [ppx_shorthand: dune build] [ppx_template: dune build]
-> installed ppx_helpers.v0.18~preview.130.36+326
Processing 70/100: [ppx_cold: dune build] [ppx_compare: dune build] [ppx_enumerate: dune build] [ppx_globalize: dune build] [ppx_shorthand: dune build] [ppx_template: dune build]
Processing 71/100: [ppx_cold: dune build] [ppx_compare: dune build] [ppx_enumerate: dune build] [ppx_globalize: dune build] [ppx_sexp_conv: dune build] [ppx_shorthand: dune build] [ppx_template: dune build]
+ /home/opam/.opam/opam-init/hooks/sandbox.sh "build" "dune" "build" "-p" "ppx_cold" "-j" "71" (CWD=/home/opam/.opam/5.2.0+flambda2/.opam-switch/build/ppx_cold.v0.18~preview.130.36+326)
-> compiled  ppx_cold.v0.18~preview.130.36+326
Processing 71/100: [ppx_compare: dune build] [ppx_enumerate: dune build] [ppx_globalize: dune build] [ppx_sexp_conv: dune build] [ppx_shorthand: dune build] [ppx_template: dune build]
-> installed ppx_cold.v0.18~preview.130.36+326
Processing 72/100: [ppx_compare: dune build] [ppx_enumerate: dune build] [ppx_globalize: dune build] [ppx_sexp_conv: dune build] [ppx_shorthand: dune build] [ppx_template: dune build]
+ /home/opam/.opam/opam-init/hooks/sandbox.sh "build" "dune" "build" "-p" "ppx_globalize" "-j" "71" (CWD=/home/opam/.opam/5.2.0+flambda2/.opam-switch/build/ppx_globalize.v0.18~preview.130.36+326)
-> compiled  ppx_globalize.v0.18~preview.130.36+326
Processing 72/100: [ppx_compare: dune build] [ppx_enumerate: dune build] [ppx_sexp_conv: dune build] [ppx_shorthand: dune build] [ppx_template: dune build]
-> installed ppx_globalize.v0.18~preview.130.36+326
Processing 73/100: [ppx_compare: dune build] [ppx_enumerate: dune build] [ppx_sexp_conv: dune build] [ppx_shorthand: dune build] [ppx_template: dune build]
+ /home/opam/.opam/opam-init/hooks/sandbox.sh "build" "dune" "build" "-p" "ppx_enumerate" "-j" "71" (CWD=/home/opam/.opam/5.2.0+flambda2/.opam-switch/build/ppx_enumerate.v0.18~preview.130.36+326)
-> compiled  ppx_enumerate.v0.18~preview.130.36+326
Processing 73/100: [ppx_compare: dune build] [ppx_sexp_conv: dune build] [ppx_shorthand: dune build] [ppx_template: dune build]
-> installed ppx_enumerate.v0.18~preview.130.36+326
Processing 74/100: [ppx_compare: dune build] [ppx_sexp_conv: dune build] [ppx_shorthand: dune build] [ppx_template: dune build]
+ /home/opam/.opam/opam-init/hooks/sandbox.sh "build" "dune" "build" "-p" "ppx_compare" "-j" "71" (CWD=/home/opam/.opam/5.2.0+flambda2/.opam-switch/build/ppx_compare.v0.18~preview.130.36+326)
-> compiled  ppx_compare.v0.18~preview.130.36+326
Processing 74/100: [ppx_sexp_conv: dune build] [ppx_shorthand: dune build] [ppx_template: dune build]
-> installed ppx_compare.v0.18~preview.130.36+326
Processing 75/100: [ppx_sexp_conv: dune build] [ppx_shorthand: dune build] [ppx_template: dune build]
+ /home/opam/.opam/opam-init/hooks/sandbox.sh "build" "dune" "build" "-p" "ppx_shorthand" "-j" "71" (CWD=/home/opam/.opam/5.2.0+flambda2/.opam-switch/build/ppx_shorthand.v0.18~preview.130.36+326)
-> compiled  ppx_shorthand.v0.18~preview.130.36+326
Processing 75/100: [ppx_sexp_conv: dune build] [ppx_template: dune build]
-> installed ppx_shorthand.v0.18~preview.130.36+326
Processing 76/100: [ppx_sexp_conv: dune build] [ppx_template: dune build]
+ /home/opam/.opam/opam-init/hooks/sandbox.sh "build" "dune" "build" "-p" "ppx_sexp_conv" "-j" "71" (CWD=/home/opam/.opam/5.2.0+flambda2/.opam-switch/build/ppx_sexp_conv.v0.18~preview.130.36+326)
-> compiled  ppx_sexp_conv.v0.18~preview.130.36+326
Processing 76/100: [ppx_template: dune build]
-> installed ppx_sexp_conv.v0.18~preview.130.36+326
Processing 77/100: [ppx_template: dune build]
Processing 78/100: [ppx_hash: dune build] [ppx_template: dune build]
+ /home/opam/.opam/opam-init/hooks/sandbox.sh "build" "dune" "build" "-p" "ppx_template" "-j" "71" (CWD=/home/opam/.opam/5.2.0+flambda2/.opam-switch/build/ppx_template.v0.18~preview.130.36+326)
-> compiled  ppx_template.v0.18~preview.130.36+326
Processing 78/100: [ppx_hash: dune build]
-> installed ppx_template.v0.18~preview.130.36+326
Processing 79/100: [ppx_hash: dune build]
+ /home/opam/.opam/opam-init/hooks/sandbox.sh "build" "dune" "build" "-p" "ppx_hash" "-j" "71" (CWD=/home/opam/.opam/5.2.0+flambda2/.opam-switch/build/ppx_hash.v0.18~preview.130.36+326)
-> compiled  ppx_hash.v0.18~preview.130.36+326
-> installed ppx_hash.v0.18~preview.130.36+326
Processing 81/100: [ppx_base: dune build]
+ /home/opam/.opam/opam-init/hooks/sandbox.sh "build" "dune" "build" "-p" "ppx_base" "-j" "71" (CWD=/home/opam/.opam/5.2.0+flambda2/.opam-switch/build/ppx_base.v0.18~preview.130.36+326)
-> compiled  ppx_base.v0.18~preview.130.36+326
-> installed ppx_base.v0.18~preview.130.36+326
Processing 83/100: [base: dune build]
+ /home/opam/.opam/opam-init/hooks/sandbox.sh "build" "dune" "build" "-p" "base" "-j" "71" (CWD=/home/opam/.opam/5.2.0+flambda2/.opam-switch/build/base.v0.18~preview.130.36+326)
- (cd _build/default && /home/opam/.opam/5.2.0+flambda2/bin/ocamlc.opt -w -40 -g -bin-annot -bin-annot-occurrences -I src/.base.objs/byte -I /home/opam/.opam/5.2.0+flambda2/lib/basement -I /home/opam/.opam/5.2.0+flambda2/lib/ocaml_intrinsics_kernel -I /home/opam/.opam/5.2.0+flambda2/lib/ppx_compare/runtime-lib -I /home/opam/.opam/5.2.0+flambda2/lib/ppx_enumerate/runtime-lib -I /home/opam/.opam/5.2.0+flambda2/lib/ppx_hash/base_internalhash_types -I /home/opam/.opam/5.2.0+flambda2/lib/ppx_hash/runtime-lib -I /home/opam/.opam/5.2.0+flambda2/lib/ppx_sexp_conv/runtime-lib -I /home/opam/.opam/5.2.0+flambda2/lib/sexplib0 -I shadow-stdlib/src/.shadow_stdlib.objs/byte -intf-suffix .ml -no-alias-deps -open Base__ -o src/.base.objs/byte/base__Modes.cmo -c -impl src/modes.pp.ml)
- File "src/modes.ml", lines 398-402, characters 2-78:
- 398 | ..type local =
- 399 |     [ `global
- 400 |     | `local of (actually_local[@compare.ignore] [@equal.ignore] [@sexp.opaque])
- 401 |     ]
- 402 |   [@@deriving compare ~localize, equal ~localize, hash, sexp_of, sexp_grammar]
- Warning 56 [unreachable-case]: this match case is unreachable.
- Consider replacing it with a refutation case '<pat> -> .'
- 
- File "src/modes.ml", lines 398-402, characters 2-78:
- 398 | ..type local =
- 399 |     [ `global
- 400 |     | `local of (actually_local[@compare.ignore] [@equal.ignore] [@sexp.opaque])
- 401 |     ]
- 402 |   [@@deriving compare ~localize, equal ~localize, hash, sexp_of, sexp_grammar]
- Warning 56 [unreachable-case]: this match case is unreachable.
- Consider replacing it with a refutation case '<pat> -> .'
- 
- File "src/modes.ml", lines 398-402, characters 2-78:
- 398 | ..type local =
- 399 |     [ `global
- 400 |     | `local of (actually_local[@compare.ignore] [@equal.ignore] [@sexp.opaque])
- 401 |     ]
- 402 |   [@@deriving compare ~localize, equal ~localize, hash, sexp_of, sexp_grammar]
- Warning 56 [unreachable-case]: this match case is unreachable.
- Consider replacing it with a refutation case '<pat> -> .'
- 
- File "src/modes.ml", lines 399-401, characters 4-5:
- 399 | ....[ `global
- 400 |     | `local of (actually_local[@compare.ignore] [@equal.ignore] [@sexp.opaque])
- 401 |     ]
- Warning 56 [unreachable-case]: this match case is unreachable.
- Consider replacing it with a refutation case '<pat> -> .'
- (cd _build/default && /home/opam/.opam/5.2.0+flambda2/bin/ocamlopt.opt -w -40 -g -O3 -flambda2-inline-max-depth 10 -I src/.base.objs/byte -I src/.base.objs/native -I /home/opam/.opam/5.2.0+flambda2/lib/basement -I /home/opam/.opam/5.2.0+flambda2/lib/ocaml_intrinsics_kernel -I /home/opam/.opam/5.2.0+flambda2/lib/ppx_compare/runtime-lib -I /home/opam/.opam/5.2.0+flambda2/lib/ppx_enumerate/runtime-lib -I /home/opam/.opam/5.2.0+flambda2/lib/ppx_hash/base_internalhash_types -I /home/opam/.opam/5.2.0+flambda2/lib/ppx_hash/runtime-lib -I /home/opam/.opam/5.2.0+flambda2/lib/ppx_sexp_conv/runtime-lib -I /home/opam/.opam/5.2.0+flambda2/lib/sexplib0 -I shadow-stdlib/src/.shadow_stdlib.objs/byte -I shadow-stdlib/src/.shadow_stdlib.objs/native -intf-suffix .ml -no-alias-deps -open Base__ -o src/.base.objs/native/base__Modes.cmx -c -impl src/modes.pp.ml)
- File "src/modes.ml", lines 398-402, characters 2-78:
- 398 | ..type local =
- 399 |     [ `global
- 400 |     | `local of (actually_local[@compare.ignore] [@equal.ignore] [@sexp.opaque])
- 401 |     ]
- 402 |   [@@deriving compare ~localize, equal ~localize, hash, sexp_of, sexp_grammar]
- Warning 56 [unreachable-case]: this match case is unreachable.
- Consider replacing it with a refutation case '<pat> -> .'
- 
- File "src/modes.ml", lines 398-402, characters 2-78:
- 398 | ..type local =
- 399 |     [ `global
- 400 |     | `local of (actually_local[@compare.ignore] [@equal.ignore] [@sexp.opaque])
- 401 |     ]
- 402 |   [@@deriving compare ~localize, equal ~localize, hash, sexp_of, sexp_grammar]
- Warning 56 [unreachable-case]: this match case is unreachable.
- Consider replacing it with a refutation case '<pat> -> .'
- 
- File "src/modes.ml", lines 398-402, characters 2-78:
- 398 | ..type local =
- 399 |     [ `global
- 400 |     | `local of (actually_local[@compare.ignore] [@equal.ignore] [@sexp.opaque])
- 401 |     ]
- 402 |   [@@deriving compare ~localize, equal ~localize, hash, sexp_of, sexp_grammar]
- Warning 56 [unreachable-case]: this match case is unreachable.
- Consider replacing it with a refutation case '<pat> -> .'
- 
- File "src/modes.ml", lines 399-401, characters 4-5:
- 399 | ....[ `global
- 400 |     | `local of (actually_local[@compare.ignore] [@equal.ignore] [@sexp.opaque])
- 401 |     ]
- Warning 56 [unreachable-case]: this match case is unreachable.
- Consider replacing it with a refutation case '<pat> -> .'
-> compiled  base.v0.18~preview.130.36+326
-> installed base.v0.18~preview.130.36+326
Processing 85/100: [ppx_here: dune build]
Processing 86/100: [ppx_here: dune build] [stdio: dune build]
+ /home/opam/.opam/opam-init/hooks/sandbox.sh "build" "dune" "build" "-p" "stdio" "-j" "71" (CWD=/home/opam/.opam/5.2.0+flambda2/.opam-switch/build/stdio.v0.18~preview.130.36+326)
-> compiled  stdio.v0.18~preview.130.36+326
Processing 86/100: [ppx_here: dune build]
-> installed stdio.v0.18~preview.130.36+326
Processing 87/100: [ppx_here: dune build]
Processing 88/100: [ppx_here: dune build] [ppx_optcomp: dune build]
+ /home/opam/.opam/opam-init/hooks/sandbox.sh "build" "dune" "build" "-p" "ppx_here" "-j" "71" (CWD=/home/opam/.opam/5.2.0+flambda2/.opam-switch/build/ppx_here.v0.18~preview.130.36+326)
-> compiled  ppx_here.v0.18~preview.130.36+326
Processing 88/100: [ppx_optcomp: dune build]
-> installed ppx_here.v0.18~preview.130.36+326
Processing 89/100: [ppx_optcomp: dune build]
Processing 90/100: [ppx_assert: dune build] [ppx_optcomp: dune build]
+ /home/opam/.opam/opam-init/hooks/sandbox.sh "build" "dune" "build" "-p" "ppx_optcomp" "-j" "71" (CWD=/home/opam/.opam/5.2.0+flambda2/.opam-switch/build/ppx_optcomp.v0.18~preview.130.36+326)
-> compiled  ppx_optcomp.v0.18~preview.130.36+326
Processing 90/100: [ppx_assert: dune build]
-> installed ppx_optcomp.v0.18~preview.130.36+326
Processing 91/100: [ppx_assert: dune build]
+ /home/opam/.opam/opam-init/hooks/sandbox.sh "build" "dune" "build" "-p" "ppx_assert" "-j" "71" (CWD=/home/opam/.opam/5.2.0+flambda2/.opam-switch/build/ppx_assert.v0.18~preview.130.36+326)
-> compiled  ppx_assert.v0.18~preview.130.36+326
-> installed ppx_assert.v0.18~preview.130.36+326
Processing 93/100: [jst-config: dune build]
+ /home/opam/.opam/opam-init/hooks/sandbox.sh "build" "dune" "build" "-p" "jst-config" "-j" "71" (CWD=/home/opam/.opam/5.2.0+flambda2/.opam-switch/build/jst-config.v0.18~preview.130.36+326)
-> compiled  jst-config.v0.18~preview.130.36+326
-> installed jst-config.v0.18~preview.130.36+326
Processing 95/100: [time_now: dune build]
+ /home/opam/.opam/opam-init/hooks/sandbox.sh "build" "dune" "build" "-p" "time_now" "-j" "71" (CWD=/home/opam/.opam/5.2.0+flambda2/.opam-switch/build/time_now.v0.18~preview.130.36+326)
-> compiled  time_now.v0.18~preview.130.36+326
-> installed time_now.v0.18~preview.130.36+326
Processing 97/100: [ppx_inline_test: dune build]
+ /home/opam/.opam/opam-init/hooks/sandbox.sh "build" "dune" "build" "-p" "ppx_inline_test" "-j" "71" (CWD=/home/opam/.opam/5.2.0+flambda2/.opam-switch/build/ppx_inline_test.v0.18~preview.130.36+326)
-> compiled  ppx_inline_test.v0.18~preview.130.36+326
-> installed ppx_inline_test.v0.18~preview.130.36+326
Processing 99/100: [mysql8: dune build]
+ /home/opam/.opam/opam-init/hooks/sandbox.sh "build" "dune" "build" "-p" "mysql8" "-j" "71" (CWD=/home/opam/.opam/5.2.0+flambda2/.opam-switch/build/mysql8.1.0)
- File "lib/dune", line 4, characters 10-22:
- 4 |  (c_names mysql8_stubs)
-               ^^^^^^^^^^^^
- (cd _build/default/lib && /usr/bin/gcc -O2 -fno-strict-aliasing -fwrapv -pthread -fPIC -pthread -D_FILE_OFFSET_BITS=64 -g -I /home/opam/.opam/5.2.0+flambda2/lib/ocaml -I /home/opam/.opam/5.2.0+flambda2/lib/base -I /home/opam/.opam/5.2.0+flambda2/lib/base/shadow_stdlib -I /home/opam/.opam/5.2.0+flambda2/lib/basement -I /home/opam/.opam/5.2.0+flambda2/lib/jane-street-headers -I /home/opam/.opam/5.2.0+flambda2/lib/ocaml_intrinsics_kernel -I /home/opam/.opam/5.2.0+flambda2/lib/ppx_compare/runtime-lib -I /home/opam/.opam/5.2.0+flambda2/lib/ppx_enumerate/runtime-lib -I /home/opam/.opam/5.2.0+flambda2/lib/ppx_hash/base_internalhash_types -I /home/opam/.opam/5.2.0+flambda2/lib/ppx_hash/runtime-lib -I /home/opam/.opam/5.2.0+flambda2/lib/ppx_inline_test/config -I /home/opam/.opam/5.2.0+flambda2/lib/ppx_inline_test/runtime-lib -I /home/opam/.opam/5.2.0+flambda2/lib/ppx_sexp_conv/runtime-lib -I /home/opam/.opam/5.2.0+flambda2/lib/sexplib0 -I /home/opam/.opam/5.2.0+flambda2/lib/time_now -o mysql8_stubs.o -c mysql8_stubs.c)
- mysql8_stubs.c:38:10: fatal error: mysql.h: No such file or directory
-    38 | #include <mysql.h>
-       |          ^~~~~~~~~
- compilation terminated.
- (cd _build/default && /home/opam/.opam/5.2.0+flambda2/bin/ocamlc.opt -w -40 -g -bin-annot -bin-annot-occurrences -I lib/.mysql8.objs/byte -I /home/opam/.opam/5.2.0+flambda2/lib/base -I /home/opam/.opam/5.2.0+flambda2/lib/base/shadow_stdlib -I /home/opam/.opam/5.2.0+flambda2/lib/basement -I /home/opam/.opam/5.2.0+flambda2/lib/jane-street-headers -I /home/opam/.opam/5.2.0+flambda2/lib/ocaml_intrinsics_kernel -I /home/opam/.opam/5.2.0+flambda2/lib/ppx_compare/runtime-lib -I /home/opam/.opam/5.2.0+flambda2/lib/ppx_enumerate/runtime-lib -I /home/opam/.opam/5.2.0+flambda2/lib/ppx_hash/base_internalhash_types -I /home/opam/.opam/5.2.0+flambda2/lib/ppx_hash/runtime-lib -I /home/opam/.opam/5.2.0+flambda2/lib/ppx_inline_test/config -I /home/opam/.opam/5.2.0+flambda2/lib/ppx_inline_test/runtime-lib -I /home/opam/.opam/5.2.0+flambda2/lib/ppx_sexp_conv/runtime-lib -I /home/opam/.opam/5.2.0+flambda2/lib/sexplib0 -I /home/opam/.opam/5.2.0+flambda2/lib/time_now -intf-suffix .ml -no-alias-deps -o lib/.mysql8.objs/byte/mysql8.cmo -c -impl lib/mysql8.pp.ml)
- File "lib/mysql8.ml", line 34, characters 8-35:
- 34 | let _ = Callback.register_exception "mysql error" (Error "Registering Callback")
-              ^^^^^^^^^^^^^^^^^^^^^^^^^^^
- Alert unsafe_multidomain: Stdlib.Callback.register_exception
- Use [Callback.Safe.register_exception].
- (cd _build/default && /home/opam/.opam/5.2.0+flambda2/bin/ocamlopt.opt -w -40 -g -I lib/.mysql8.objs/byte -I lib/.mysql8.objs/native -I /home/opam/.opam/5.2.0+flambda2/lib/base -I /home/opam/.opam/5.2.0+flambda2/lib/base/shadow_stdlib -I /home/opam/.opam/5.2.0+flambda2/lib/basement -I /home/opam/.opam/5.2.0+flambda2/lib/jane-street-headers -I /home/opam/.opam/5.2.0+flambda2/lib/ocaml_intrinsics_kernel -I /home/opam/.opam/5.2.0+flambda2/lib/ppx_compare/runtime-lib -I /home/opam/.opam/5.2.0+flambda2/lib/ppx_enumerate/runtime-lib -I /home/opam/.opam/5.2.0+flambda2/lib/ppx_hash/base_internalhash_types -I /home/opam/.opam/5.2.0+flambda2/lib/ppx_hash/runtime-lib -I /home/opam/.opam/5.2.0+flambda2/lib/ppx_inline_test/config -I /home/opam/.opam/5.2.0+flambda2/lib/ppx_inline_test/runtime-lib -I /home/opam/.opam/5.2.0+flambda2/lib/ppx_sexp_conv/runtime-lib -I /home/opam/.opam/5.2.0+flambda2/lib/sexplib0 -I /home/opam/.opam/5.2.0+flambda2/lib/time_now -intf-suffix .ml -no-alias-deps -o lib/.mysql8.objs/native/mysql8.cmx -c -impl lib/mysql8.pp.ml)
- File "lib/mysql8.ml", line 34, characters 8-35:
- 34 | let _ = Callback.register_exception "mysql error" (Error "Registering Callback")
-              ^^^^^^^^^^^^^^^^^^^^^^^^^^^
- Alert unsafe_multidomain: Stdlib.Callback.register_exception
- Use [Callback.Safe.register_exception].
[ERROR] The compilation of mysql8.1.0 failed at "dune build -p mysql8 -j 71".

#=== ERROR while compiling mysql8.1.0 =========================================#
# context              2.4.1 | linux/x86_64 | ocaml-variants.5.2.0+ox | file:///home/opam/opam-repository
# path                 ~/.opam/5.2.0+flambda2/.opam-switch/build/mysql8.1.0
# command              ~/.opam/opam-init/hooks/sandbox.sh build dune build -p mysql8 -j 71
# exit-code            1
# env-file             ~/.opam/log/mysql8-8-ef59df.env
# output-file          ~/.opam/log/mysql8-8-ef59df.out
### output ###
# File "lib/dune", line 4, characters 10-22:
# 4 |  (c_names mysql8_stubs)
#               ^^^^^^^^^^^^
# (cd _build/default/lib && /usr/bin/gcc -O2 -fno-strict-aliasing -fwrapv -pthread -fPIC -pthread -D_FILE_OFFSET_BITS=64 -g -I /home/opam/.opam/5.2.0+flambda2/lib/ocaml -I /home/opam/.opam/5.2.0+flambda2/lib/base -I /home/opam/.opam/5.2.0+flambda2/lib/base/shadow_stdlib -I /home/opam/.opam/5.2.0+flambda2/lib/basement -I /home/opam/.opam/5.2.0+flambda2/lib/jane-street-headers -I /home/opam/.opam/5.2.0+flambda2/lib/ocaml_intrinsics_kernel -I /home/opam/.opam/5.2.0+flambda2/lib/ppx_compare/runtime-lib -I /home/opam/.opam/5.2.0+flambda2/lib/ppx_enumerate/runtime-lib -I /home/opam/.opam/5.2.0+flambda2/lib/ppx_hash/base_internalhash_types -I /home/opam/.opam/5.2.0+flambda2/lib/ppx_hash/runtime-lib -I /home/opam/.opam/5.2.0+flambda2/lib/ppx_inline_test/config -I /home/opam/.opam/5.2.0+flambda2/lib/ppx_inline_test/runtime-lib -I /home/opam/.opam/5.2.0+flambda2/lib/ppx_sexp_conv/runtime-lib -I /home/opam/.opam/5.2.0+flambda2/lib/sexplib0 -I /home/opam/.opam/5.2.0+flambda2/lib/time_now -o mysql8_stubs.o -c mysql8_stubs.c)
# mysql8_stubs.c:38:10: fatal error: mysql.h: No such file or directory
#    38 | #include <mysql.h>
#       |          ^~~~~~~~~
# compilation terminated.
# (cd _build/default && /home/opam/.opam/5.2.0+flambda2/bin/ocamlc.opt -w -40 -g -bin-annot -bin-annot-occurrences -I lib/.mysql8.objs/byte -I /home/opam/.opam/5.2.0+flambda2/lib/base -I /home/opam/.opam/5.2.0+flambda2/lib/base/shadow_stdlib -I /home/opam/.opam/5.2.0+flambda2/lib/basement -I /home/opam/.opam/5.2.0+flambda2/lib/jane-street-headers -I /home/opam/.opam/5.2.0+flambda2/lib/ocaml_intrinsics_kernel -I /home/opam/.opam/5.2.0+flambda2/lib/ppx_compare/runtime-lib -I /home/opam/.opam/5.2.0+flambda2/lib/ppx_enumerate/runtime-lib -I /home/opam/.opam/5.2.0+flambda2/lib/ppx_hash/base_internalhash_types -I /home/opam/.opam/5.2.0+flambda2/lib/ppx_hash/runtime-lib -I /home/opam/.opam/5.2.0+flambda2/lib/ppx_inline_test/config -I /home/opam/.opam/5.2.0+flambda2/lib/ppx_inline_test/runtime-lib -I /home/opam/.opam/5.2.0+flambda2/lib/ppx_sexp_conv/runtime-lib -I /home/opam/.opam/5.2.0+flambda2/lib/sexplib0 -I /home/opam/.opam/5.2.0+flambda2/lib/time_now -intf-suffix .ml -no-alias-deps -o lib/.mysql8.objs/byte/mysql8.cmo -c -impl lib/mysql8.pp.ml)
# File "lib/mysql8.ml", line 34, characters 8-35:
# 34 | let _ = Callback.register_exception "mysql error" (Error "Registering Callback")
#              ^^^^^^^^^^^^^^^^^^^^^^^^^^^
# Alert unsafe_multidomain: Stdlib.Callback.register_exception
# Use [Callback.Safe.register_exception].
# (cd _build/default && /home/opam/.opam/5.2.0+flambda2/bin/ocamlopt.opt -w -40 -g -I lib/.mysql8.objs/byte -I lib/.mysql8.objs/native -I /home/opam/.opam/5.2.0+flambda2/lib/base -I /home/opam/.opam/5.2.0+flambda2/lib/base/shadow_stdlib -I /home/opam/.opam/5.2.0+flambda2/lib/basement -I /home/opam/.opam/5.2.0+flambda2/lib/jane-street-headers -I /home/opam/.opam/5.2.0+flambda2/lib/ocaml_intrinsics_kernel -I /home/opam/.opam/5.2.0+flambda2/lib/ppx_compare/runtime-lib -I /home/opam/.opam/5.2.0+flambda2/lib/ppx_enumerate/runtime-lib -I /home/opam/.opam/5.2.0+flambda2/lib/ppx_hash/base_internalhash_types -I /home/opam/.opam/5.2.0+flambda2/lib/ppx_hash/runtime-lib -I /home/opam/.opam/5.2.0+flambda2/lib/ppx_inline_test/config -I /home/opam/.opam/5.2.0+flambda2/lib/ppx_inline_test/runtime-lib -I /home/opam/.opam/5.2.0+flambda2/lib/ppx_sexp_conv/runtime-lib -I /home/opam/.opam/5.2.0+flambda2/lib/sexplib0 -I /home/opam/.opam/5.2.0+flambda2/lib/time_now -intf-suffix .ml -no-alias-deps -o lib/.mysql8.objs/native/mysql8.cmx -c -impl lib/mysql8.pp.ml)
# File "lib/mysql8.ml", line 34, characters 8-35:
# 34 | let _ = Callback.register_exception "mysql error" (Error "Registering Callback")
#              ^^^^^^^^^^^^^^^^^^^^^^^^^^^
# Alert unsafe_multidomain: Stdlib.Callback.register_exception
# Use [Callback.Safe.register_exception].



<><> Error report <><><><><><><><><><><><><><><><><><><><><><><><><><><><><><><>
+- The following actions failed
| - build mysql8 1.0
+- 
+- The following changes have been performed
| - install base                    v0.18~preview.130.36+326
| - install basement                v0.18~preview.130.36+326
| - install conf-bash               1
| - install conf-mysql              1
| - install csexp                   1.5.2
| - install dune                    3.19.1
| - install dune-configurator       3.19.1
| - install jane-street-headers     v0.18~preview.130.36+326
| - install jst-config              v0.18~preview.130.36+326
| - install ocaml-compiler-libs     v0.17.0+ox
| - install ocaml_intrinsics_kernel v0.18~preview.130.36+326
| - install ppx_assert              v0.18~preview.130.36+326
| - install ppx_base                v0.18~preview.130.36+326
| - install ppx_cold                v0.18~preview.130.36+326
| - install ppx_compare             v0.18~preview.130.36+326
| - install ppx_derivers            1.2.1
| - install ppx_enumerate           v0.18~preview.130.36+326
| - install ppx_globalize           v0.18~preview.130.36+326
| - install ppx_hash                v0.18~preview.130.36+326
| - install ppx_helpers             v0.18~preview.130.36+326
| - install ppx_here                v0.18~preview.130.36+326
| - install ppx_inline_test         v0.18~preview.130.36+326
| - install ppx_optcomp             v0.18~preview.130.36+326
| - install ppx_sexp_conv           v0.18~preview.130.36+326
| - install ppx_shorthand           v0.18~preview.130.36+326
| - install ppx_template            v0.18~preview.130.36+326
| - install ppxlib                  0.33.0+ox
| - install ppxlib_ast              0.33.0+ox
| - install ppxlib_jane             v0.18~preview.130.36+326
| - install sexplib0                v0.18~preview.130.36+326
| - install stdio                   v0.18~preview.130.36+326
| - install stdlib-shims            0.3.0
| - install time_now                v0.18~preview.130.36+326
+- 
# To update the current shell environment, run: eval $(opam env)

The former state can be restored with:
    /usr/bin/opam switch import "/home/opam/.opam/5.2.0+flambda2/.opam-switch/backup/state-20250807081723.export"
'opam install -vy mysql8.1.0' failed.
"/usr/bin/env" "bash" "-c" "opam remove -y mysql8.1.0
opam install -vy mysql8.1.0
res=$?
if [ $res = 31 ]; then
    if opam show -f x-ci-accept-failures: mysql8.1.0 | grep -q 'debian-unstable'; then
        echo "This package failed and has been disabled for CI using the 'x-ci-accept-failures' field."
        exit 69
    fi
fi 


exit $res" failed with exit status 31
Failed: Build failed