OCamllabs icon Home|Differences with the last checks|Previous runs


Building on eumache

(from ocaml/opam:debian-unstable)
Unable to find image 'ocaml/opam:debian-unstable' locally
debian-unstable: Pulling from ocaml/opam
f6fae32d1855: Already exists
2b6b54cb75df: Already exists
7f4f75d80dc4: Already exists
86f2c2d376f7: Already exists
5fce5bf93f18: Already exists
91d6c59c3ffe: Already exists
9780bb50741d: Already exists
51f01f04294b: Already exists
46b42b345cac: Already exists
1dd5551ce92c: Already exists
55008ed07edc: Already exists
c1e792eee16f: Already exists
b2a816a70be2: Already exists
64b40eba7a69: Already exists
11491332e35e: Already exists
3314a0772c11: Already exists
9ba5ca987e73: Already exists
a5233de9b1e5: Already exists
bc6dd62b0adb: Already exists
17089b4923c4: Already exists
4dc2bdc414fd: Already exists
4f4fb700ef54: Already exists
1778f929414c: Already exists
21b3034f3560: Already exists
abe40b09cbf3: Already exists
1b0f9717b4f3: Already exists
46bab8457678: Already exists
f75badf20e81: Already exists
92b4348edd65: Already exists
f8b463772393: Already exists
dad7d278149c: Already exists
0ef56c176f19: Already exists
3fe17d841d7c: Already exists
cc682b2328b3: Already exists
f7c09bb9eac2: Already exists
8d492df13af5: Already exists
662d55711822: Already exists
d6cf62251a72: Already exists
d4bb9947b77b: Already exists
27daec8f3c08: Already exists
55b11b2bcb90: Already exists
a81f69018a14: Already exists
8af2fc2aec5d: Already exists
513e8402745e: Already exists
fd135f97ec6f: Already exists
bdd7d5de62c2: Already exists
382b95d961ba: Already exists
Digest: sha256:867738023289fd26cdb69fad77687cf4ed3a8bf60dcddabdf3cc53c705746fd2
Status: Downloaded newer image for ocaml/opam:debian-unstable
2025-08-07 08:02.16 ---> using "0acd5aeaa8f7bc314514d9795d14a7f12ec72a6a5b11c5904350189734c6859b" from cache

/: (user (uid 1000) (gid 1000))

/: (env OPAMPRECISETRACKING 1)

/: (env OPAMUTF8 never)

/: (env OPAMEXTERNALSOLVER builtin-0install)

/: (env OPAMCRITERIA +removed)

/: (env CI true)

/: (env OPAM_HEALTH_CHECK_CI true)

/: (run (shell "sudo ln -f /usr/bin/opam-dev /usr/bin/opam"))
2025-08-07 08:02.16 ---> using "40df4fa4cdfc68a5fa7a326047e82a7adc5df52b8059d4a7b745bdd50aad56e7" from cache

/: (run (network host)
        (shell "rm -rf ~/opam-repository && git clone -q 'https://github.com/ocaml/opam-repository' ~/opam-repository && git -C ~/opam-repository checkout -q 06a1064b82e87c7ef006235ec98f1c89487892c9"))
2025-08-07 08:02.16 ---> using "190c02cbe0dbf4a8b0af5361aa9e25640f87291c4fe861cc6cf855e0fda3a8c0" from cache

/: (run (shell "rm -rf ~/.opam && opam init -ya --bare --config ~/.opamrc-sandbox ~/opam-repository"))
Configuring from /home/opam/.opamrc-sandbox, then /home/opam/.opamrc, and finally from built-in defaults.
Checking for available remotes: rsync and local, git.
  - you won't be able to use mercurial repositories unless you install the hg command on your system.
  - you won't be able to use darcs repositories unless you install the darcs command on your system.


<><> Fetching repository information ><><><><><><><><><><><><><><><><><><><><><>
[default] Initialised

User configuration:
  ~/.profile is already up-to-date.
[NOTE] Make sure that ~/.profile is well sourced in your ~/.bashrc.

2025-08-07 08:02.16 ---> using "012c52728bded521bf1d53a4382a5dac829cfe1a6f3ed7b53cc733c53b2d91cb" from cache

/: (run (cache (opam-archives (target /home/opam/.opam/download-cache)))
        (network host)
        (shell "sudo apt update && sudo apt install autoconf -y"))

WARNING: apt does not have a stable CLI interface. Use with caution in scripts.

Get:1 http://deb.debian.org/debian unstable InRelease [216 kB]
Get:2 http://deb.debian.org/debian unstable/main amd64 Packages.diff/Index [63.6 kB]
Get:3 http://deb.debian.org/debian unstable/main amd64 Packages T-2025-08-07-0205.44-F-2025-08-02-0804.37.pdiff [69.1 kB]
Get:3 http://deb.debian.org/debian unstable/main amd64 Packages T-2025-08-07-0205.44-F-2025-08-02-0804.37.pdiff [69.1 kB]
Fetched 348 kB in 2s (162 kB/s)
Reading package lists...
Building dependency tree...
Reading state information...
4 packages can be upgraded. Run 'apt list --upgradable' to see them.

WARNING: apt does not have a stable CLI interface. Use with caution in scripts.

Reading package lists...
Building dependency tree...
Reading state information...
Installing:
  autoconf

Installing dependencies:
  automake  autotools-dev  m4

Suggested packages:
  autoconf-archive  gnu-standards  autoconf-doc  libtool  gettext  m4-doc

Summary:
  Upgrading: 0, Installing: 4, Removing: 0, Not Upgrading: 4
  Download size: 1710 kB
  Space needed: 5051 kB / 230 GB available

Get:1 http://deb.debian.org/debian unstable/main amd64 m4 amd64 1.4.19-8 [294 kB]
Get:2 http://deb.debian.org/debian unstable/main amd64 autoconf all 2.72-3.1 [494 kB]
Get:3 http://deb.debian.org/debian unstable/main amd64 autotools-dev all 20240727.1 [60.2 kB]
Get:4 http://deb.debian.org/debian unstable/main amd64 automake all 1:1.17-4 [862 kB]
Fetched 1710 kB in 0s (30.8 MB/s)
Selecting previously unselected package m4.
(Reading database ... 
(Reading database ... 5%
(Reading database ... 10%
(Reading database ... 15%
(Reading database ... 20%
(Reading database ... 25%
(Reading database ... 30%
(Reading database ... 35%
(Reading database ... 40%
(Reading database ... 45%
(Reading database ... 50%
(Reading database ... 55%
(Reading database ... 60%
(Reading database ... 65%
(Reading database ... 70%
(Reading database ... 75%
(Reading database ... 80%
(Reading database ... 85%
(Reading database ... 90%
(Reading database ... 95%
(Reading database ... 100%
(Reading database ... 20685 files and directories currently installed.)
Preparing to unpack .../archives/m4_1.4.19-8_amd64.deb ...
Unpacking m4 (1.4.19-8) ...
Selecting previously unselected package autoconf.
Preparing to unpack .../autoconf_2.72-3.1_all.deb ...
Unpacking autoconf (2.72-3.1) ...
Selecting previously unselected package autotools-dev.
Preparing to unpack .../autotools-dev_20240727.1_all.deb ...
Unpacking autotools-dev (20240727.1) ...
Selecting previously unselected package automake.
Preparing to unpack .../automake_1%3a1.17-4_all.deb ...
Unpacking automake (1:1.17-4) ...
Setting up m4 (1.4.19-8) ...
Setting up autotools-dev (20240727.1) ...
Setting up autoconf (2.72-3.1) ...
Setting up automake (1:1.17-4) ...
update-alternatives: using /usr/bin/automake-1.17 to provide /usr/bin/automake (automake) in auto mode
2025-08-07 08:02.16 ---> using "159374d4dfbeb7f87b486ade5afe9a00b3d6b0bdba42573a1887cdb5e30fe45b" from cache

/: (run (network host)
        (shell "git clone -q 'https://github.com/oxcaml/opam-repository' ~/'oxcaml' && git -C ~/'oxcaml' checkout -q 29656e8e76b4441b5b62db11d35d193e380298ca"))
2025-08-07 08:02.16 ---> using "b5848cf3bbbc0c4981e5d5e3d9bcec3b4c6b4225e188081cd30294eec97db7b4" from cache

/: (run (shell "opam repository add --dont-select 'oxcaml' ~/'oxcaml'"))
[oxcaml] Initialised
2025-08-07 08:02.16 ---> using "c846a1cc387dcbe1a71e6838f59ad7ff1920eabe18952f84a40fd0b2a4641443" from cache

/: (run (cache (opam-archives (target /home/opam/.opam/download-cache)))
        (network host)
        (shell "opam switch create --repositories=oxcaml,default '5.2.0+flambda2' '5.2.0+ox'"))

<><> Installing new switch packages <><><><><><><><><><><><><><><><><><><><><><>
Switch invariant: ["ocaml-variants" {= "5.2.0+ox"}]

<><> Processing actions <><><><><><><><><><><><><><><><><><><><><><><><><><><><>
-> retrieved ocaml-config.3  (cached)
-> installed base-bigarray.base
-> installed base-threads.base
-> installed base-unix.base
-> installed ocaml-options-vanilla.1
-> installed conf-autoconf.0.2
-> installed conf-which.1
-> retrieved ocaml-variants.5.2.0+ox  (https://github.com/oxcaml/oxcaml/archive/refs/tags/5.2.0minus-11-opam.tar.gz)
-> installed ocaml-variants.5.2.0+ox
-> installed ocaml-config.3
-> installed ocaml.5.2.0
-> installed base-domains.base
-> installed base-nnp.base
Done.
# To update the current shell environment, run: eval $(opam env --switch=5.2.0+flambda2)
2025-08-07 08:02.16 ---> using "059e4c8d9fde813aed5ba328af1b91f6cd5242b6bc0b704a2be07cd5d14bb4e8" from cache

/: (run (network host)
        (shell "opam update --depexts"))
+ /usr/bin/sudo "apt-get" "update"
- Hit:1 http://deb.debian.org/debian unstable InRelease
- Reading package lists...
2025-08-07 08:02.16 ---> using "7b9500581933009c35fa6ed9ef22a28eda258d356f0b06a637af33ddf697e0af" from cache

/: (run (cache (opam-archives (target /home/opam/.opam/download-cache)))
        (network host)
        (shell  "opam remove -y guile.1.0\
               \nopam install -vy guile.1.0\
               \nres=$?\
               \nif [ $res = 31 ]; then\
               \n    if opam show -f x-ci-accept-failures: guile.1.0 | grep -q 'debian-unstable'; then\
               \n        echo \"This package failed and has been disabled for CI using the 'x-ci-accept-failures' field.\"\
               \n        exit 69\
               \n    fi\
               \nfi \
               \n\
               \n\
               \nexit $res"))
[NOTE] guile.1.0 is not installed.

Nothing to do.
The following actions will be performed:
=== install 37 packages
  - install base                    v0.18~preview.130.36+326 [required by stdio]
  - install basement                v0.18~preview.130.36+326 [required by sexplib]
  - install bigarray-compat         1.1.0                    [required by ctypes]
  - install conf-bash               1                        [required by ppxlib_ast]
  - install conf-gmp                5                        [required by guile]
  - install conf-guile              1                        [required by guile]
  - install conf-libffi             2.0.0                    [required by ctypes-foreign]
  - install conf-pkg-config         4                        [required by conf-guile, ctypes-foreign]
  - install csexp                   1.5.2                    [required by dune-configurator]
  - install ctypes                  0.23.0                   [required by guile]
  - install ctypes-foreign          0.23.0                   [required by guile]
  - install dune                    3.19.1                   [required by guile]
  - install dune-configurator       3.19.1                   [required by guile]
  - install guile                   1.0
  - install integers                0.7.0                    [required by ctypes]
  - install num                     1.6                      [required by sexplib]
  - install ocaml-compiler-libs     v0.17.0+ox               [required by ppx_hash]
  - install ocaml_intrinsics_kernel v0.18~preview.130.36+326 [required by base]
  - install parsexp                 v0.18~preview.130.36+326 [required by sexplib]
  - install ppx_base                v0.18~preview.130.36+326 [required by base]
  - install ppx_cold                v0.18~preview.130.36+326 [required by base]
  - install ppx_compare             v0.18~preview.130.36+326 [required by ppx_base]
  - install ppx_derivers            1.2.1                    [required by ppxlib]
  - install ppx_enumerate           v0.18~preview.130.36+326 [required by ppx_base]
  - install ppx_globalize           v0.18~preview.130.36+326 [required by ppx_base]
  - install ppx_hash                v0.18~preview.130.36+326 [required by base]
  - install ppx_helpers             v0.18~preview.130.36+326 [required by ppx_sexp_conv]
  - install ppx_sexp_conv           v0.18~preview.130.36+326 [required by ppx_base]
  - install ppx_shorthand           v0.18~preview.130.36+326 [required by ppx_base]
  - install ppx_template            v0.18~preview.130.36+326 [required by ppx_base]
  - install ppxlib                  0.33.0+ox                [required by base]
  - install ppxlib_ast              0.33.0+ox                [required by ppxlib]
  - install ppxlib_jane             v0.18~preview.130.36+326 [required by base]
  - install sexplib                 v0.18~preview.130.36+326 [required by guile]
  - install sexplib0                v0.18~preview.130.36+326 [required by sexplib, stdio]
  - install stdio                   v0.18~preview.130.36+326 [required by guile]
  - install stdlib-shims            0.3.0                    [required by integers]

The following system packages will first need to be installed:
    guile-3.0-dev libffi-dev libgmp-dev pkg-config

<><> Handling external dependencies <><><><><><><><><><><><><><><><><><><><><><>

opam believes some required external dependencies are missing. opam can:
> 1. Run apt-get to install them (may need root/sudo access)
  2. Display the recommended apt-get command and wait while you run it manually (e.g. in another terminal)
  3. Continue anyway, and, upon success, permanently register that this external dependency is present, but not detectable
  4. Abort the installation

[1/2/3/4] 1

+ /usr/bin/sudo "apt-get" "install" "-qq" "-yy" "guile-3.0-dev" "libffi-dev" "libgmp-dev" "pkg-config"
- Selecting previously unselected package readline-common.
- (Reading database ... 
(Reading database ... 5%
(Reading database ... 10%
(Reading database ... 15%
(Reading database ... 20%
(Reading database ... 25%
(Reading database ... 30%
(Reading database ... 35%
(Reading database ... 40%
(Reading database ... 45%
(Reading database ... 50%
(Reading database ... 55%
(Reading database ... 60%
(Reading database ... 65%
(Reading database ... 70%
(Reading database ... 75%
(Reading database ... 80%
(Reading database ... 85%
(Reading database ... 90%
(Reading database ... 95%
(Reading database ... 100%
(Reading database ... 21005 files and directories currently installed.)
- Preparing to unpack .../00-readline-common_8.2-6_all.deb ...
- Unpacking readline-common (8.2-6) ...
- Selecting previously unselected package libmagic-mgc.
- Preparing to unpack .../01-libmagic-mgc_1%3a5.46-5_amd64.deb ...
- Unpacking libmagic-mgc (1:5.46-5) ...
- Selecting previously unselected package libmagic1t64:amd64.
- Preparing to unpack .../02-libmagic1t64_1%3a5.46-5_amd64.deb ...
- Unpacking libmagic1t64:amd64 (1:5.46-5) ...
- Selecting previously unselected package file.
- Preparing to unpack .../03-file_1%3a5.46-5_amd64.deb ...
- Unpacking file (1:5.46-5) ...
- Selecting previously unselected package libgc1:amd64.
- Preparing to unpack .../04-libgc1_1%3a8.2.8-1_amd64.deb ...
- Unpacking libgc1:amd64 (1:8.2.8-1) ...
- Selecting previously unselected package libreadline8t64:amd64.
- Preparing to unpack .../05-libreadline8t64_8.2-6_amd64.deb ...
- Adding 'diversion of /lib/x86_64-linux-gnu/libhistory.so.8 to /lib/x86_64-linux-gnu/libhistory.so.8.usr-is-merged by libreadline8t64'
- Adding 'diversion of /lib/x86_64-linux-gnu/libhistory.so.8.2 to /lib/x86_64-linux-gnu/libhistory.so.8.2.usr-is-merged by libreadline8t64'
- Adding 'diversion of /lib/x86_64-linux-gnu/libreadline.so.8 to /lib/x86_64-linux-gnu/libreadline.so.8.usr-is-merged by libreadline8t64'
- Adding 'diversion of /lib/x86_64-linux-gnu/libreadline.so.8.2 to /lib/x86_64-linux-gnu/libreadline.so.8.2.usr-is-merged by libreadline8t64'
- Unpacking libreadline8t64:amd64 (8.2-6) ...
- Selecting previously unselected package guile-3.0-libs:amd64.
- Preparing to unpack .../06-guile-3.0-libs_3.0.10+really3.0.10-4_amd64.deb ...
- Unpacking guile-3.0-libs:amd64 (3.0.10+really3.0.10-4) ...
- Selecting previously unselected package guile-3.0.
- Preparing to unpack .../07-guile-3.0_3.0.10+really3.0.10-4_amd64.deb ...
- Unpacking guile-3.0 (3.0.10+really3.0.10-4) ...
- Selecting previously unselected package libncurses6:amd64.
- Preparing to unpack .../08-libncurses6_6.5+20250216-2_amd64.deb ...
- Unpacking libncurses6:amd64 (6.5+20250216-2) ...
- Selecting previously unselected package libncurses-dev:amd64.
- Preparing to unpack .../09-libncurses-dev_6.5+20250216-2_amd64.deb ...
- Unpacking libncurses-dev:amd64 (6.5+20250216-2) ...
- Selecting previously unselected package libreadline-dev:amd64.
- Preparing to unpack .../10-libreadline-dev_8.2-6_amd64.deb ...
- Unpacking libreadline-dev:amd64 (8.2-6) ...
- Selecting previously unselected package libltdl7:amd64.
- Preparing to unpack .../11-libltdl7_2.5.4-4_amd64.deb ...
- Unpacking libltdl7:amd64 (2.5.4-4) ...
- Selecting previously unselected package libltdl-dev:amd64.
- Preparing to unpack .../12-libltdl-dev_2.5.4-4_amd64.deb ...
- Unpacking libltdl-dev:amd64 (2.5.4-4) ...
- Selecting previously unselected package libgmpxx4ldbl:amd64.
- Preparing to unpack .../13-libgmpxx4ldbl_2%3a6.3.0+dfsg-3_amd64.deb ...
- Unpacking libgmpxx4ldbl:amd64 (2:6.3.0+dfsg-3) ...
- Selecting previously unselected package libgmp-dev:amd64.
- Preparing to unpack .../14-libgmp-dev_2%3a6.3.0+dfsg-3_amd64.deb ...
- Unpacking libgmp-dev:amd64 (2:6.3.0+dfsg-3) ...
- Selecting previously unselected package libgc-dev:amd64.
- Preparing to unpack .../15-libgc-dev_1%3a8.2.8-1_amd64.deb ...
- Unpacking libgc-dev:amd64 (1:8.2.8-1) ...
- Selecting previously unselected package libpkgconf3:amd64.
- Preparing to unpack .../16-libpkgconf3_1.8.1-4_amd64.deb ...
- Unpacking libpkgconf3:amd64 (1.8.1-4) ...
- Selecting previously unselected package pkgconf-bin.
- Preparing to unpack .../17-pkgconf-bin_1.8.1-4_amd64.deb ...
- Unpacking pkgconf-bin (1.8.1-4) ...
- Selecting previously unselected package pkgconf:amd64.
- Preparing to unpack .../18-pkgconf_1.8.1-4_amd64.deb ...
- Unpacking pkgconf:amd64 (1.8.1-4) ...
- Selecting previously unselected package guile-3.0-dev.
- Preparing to unpack .../19-guile-3.0-dev_3.0.10+really3.0.10-4_amd64.deb ...
- Unpacking guile-3.0-dev (3.0.10+really3.0.10-4) ...
- Selecting previously unselected package libffi-dev:amd64.
- Preparing to unpack .../20-libffi-dev_3.4.8-2_amd64.deb ...
- Unpacking libffi-dev:amd64 (3.4.8-2) ...
- Selecting previously unselected package libtool.
- Preparing to unpack .../21-libtool_2.5.4-4_all.deb ...
- Unpacking libtool (2.5.4-4) ...
- Selecting previously unselected package pkg-config:amd64.
- Preparing to unpack .../22-pkg-config_1.8.1-4_amd64.deb ...
- Unpacking pkg-config:amd64 (1.8.1-4) ...
- Setting up libmagic-mgc (1:5.46-5) ...
- Setting up libmagic1t64:amd64 (1:5.46-5) ...
- Setting up file (1:5.46-5) ...
- Setting up libffi-dev:amd64 (3.4.8-2) ...
- Setting up libpkgconf3:amd64 (1.8.1-4) ...
- Setting up libgmpxx4ldbl:amd64 (2:6.3.0+dfsg-3) ...
- Setting up libncurses6:amd64 (6.5+20250216-2) ...
- Setting up pkgconf-bin (1.8.1-4) ...
- Setting up libgc1:amd64 (1:8.2.8-1) ...
- Setting up libltdl7:amd64 (2.5.4-4) ...
- Setting up libgc-dev:amd64 (1:8.2.8-1) ...
- Setting up readline-common (8.2-6) ...
- Setting up libncurses-dev:amd64 (6.5+20250216-2) ...
- Setting up libgmp-dev:amd64 (2:6.3.0+dfsg-3) ...
- Setting up libtool (2.5.4-4) ...
- Setting up pkgconf:amd64 (1.8.1-4) ...
- Setting up libltdl-dev:amd64 (2.5.4-4) ...
- Setting up pkg-config:amd64 (1.8.1-4) ...
- Setting up libreadline8t64:amd64 (8.2-6) ...
- Setting up guile-3.0-libs:amd64 (3.0.10+really3.0.10-4) ...
- Setting up libreadline-dev:amd64 (8.2-6) ...
- Setting up guile-3.0 (3.0.10+really3.0.10-4) ...
- update-alternatives: using /usr/lib/x86_64-linux-gnu/guile/3.0/bin/guile to provide /usr/bin/guile (guile) in auto mode
- Setting up guile-3.0-dev (3.0.10+really3.0.10-4) ...
- update-alternatives: using /usr/bin/guile-config-3.0 to provide /usr/bin/guile-config (guile-config) in auto mode
- update-alternatives: using /usr/share/aclocal/guile-3.0.m4 to provide /usr/share/aclocal/guile.m4 (guile-autoconf-macros) in auto mode
- Processing triggers for libc-bin (2.41-11) ...

<><> Processing actions <><><><><><><><><><><><><><><><><><><><><><><><><><><><>
Processing  1/108: [base.v0.18~preview.130.36+326: extract]
Processing  2/108: [base.v0.18~preview.130.36+326: extract] [basement.v0.18~preview.130.36+326: extract]
Processing  3/108: [base.v0.18~preview.130.36+326: extract] [basement.v0.18~preview.130.36+326: extract] [bigarray-compat.1.1.0: extract]
-> retrieved base.v0.18~preview.130.36+326  (cached)
Processing  3/108: [basement.v0.18~preview.130.36+326: extract] [bigarray-compat.1.1.0: extract]
Processing  4/108: [basement.v0.18~preview.130.36+326: extract] [bigarray-compat.1.1.0: extract]
-> retrieved conf-gmp.5  (cached)
Processing  5/108: [basement.v0.18~preview.130.36+326: extract] [bigarray-compat.1.1.0: extract]
Processing  6/108: [basement.v0.18~preview.130.36+326: extract] [bigarray-compat.1.1.0: extract]
Processing  7/108: [basement.v0.18~preview.130.36+326: extract] [bigarray-compat.1.1.0: extract]
Processing  8/108: [basement.v0.18~preview.130.36+326: extract] [bigarray-compat.1.1.0: extract]
Processing  9/108: [basement.v0.18~preview.130.36+326: extract] [bigarray-compat.1.1.0: extract] [csexp.1.5.2: extract]
Processing 10/108: [basement.v0.18~preview.130.36+326: extract] [bigarray-compat.1.1.0: extract] [csexp.1.5.2: extract] [conf-bash: bash]
Processing 11/108: [basement.v0.18~preview.130.36+326: extract] [bigarray-compat.1.1.0: extract] [csexp.1.5.2: extract] [conf-bash: bash] [conf-gmp: sh]
Processing 12/108: [basement.v0.18~preview.130.36+326: extract] [bigarray-compat.1.1.0: extract] [csexp.1.5.2: extract] [conf-bash: bash] [conf-gmp: sh] [conf-pkg-config: pkg-config]
-> retrieved basement.v0.18~preview.130.36+326  (cached)
Processing 12/108: [bigarray-compat.1.1.0: extract] [csexp.1.5.2: extract] [conf-bash: bash] [conf-gmp: sh] [conf-pkg-config: pkg-config]
Processing 13/108: [bigarray-compat.1.1.0: extract] [csexp.1.5.2: extract] [ctypes.0.23.0, ctypes-foreign.0.23.0: extract] [conf-bash: bash] [conf-gmp: sh] [conf-pkg-config: pkg-config]
-> retrieved bigarray-compat.1.1.0  (cached)
Processing 13/108: [csexp.1.5.2: extract] [ctypes.0.23.0, ctypes-foreign.0.23.0: extract] [conf-bash: bash] [conf-gmp: sh] [conf-pkg-config: pkg-config]
Processing 14/108: [csexp.1.5.2: extract] [ctypes.0.23.0, ctypes-foreign.0.23.0: extract] [dune.3.19.1, dune-configurator.3.19.1: extract] [conf-bash: bash] [conf-gmp: sh] [conf-pkg-config: pkg-config]
-> retrieved csexp.1.5.2  (cached)
Processing 14/108: [ctypes.0.23.0, ctypes-foreign.0.23.0: extract] [dune.3.19.1, dune-configurator.3.19.1: extract] [conf-bash: bash] [conf-gmp: sh] [conf-pkg-config: pkg-config]
Processing 15/108: [ctypes.0.23.0, ctypes-foreign.0.23.0: extract] [dune.3.19.1, dune-configurator.3.19.1: extract] [guile.1.0: http] [conf-bash: bash] [conf-gmp: sh] [conf-pkg-config: pkg-config]
+ /home/opam/.opam/opam-init/hooks/sandbox.sh "build" "pkg-config" "--help" (CWD=/home/opam/.opam/5.2.0+flambda2/.opam-switch/build/conf-pkg-config.4)
- usage: pkgconf [OPTIONS] [LIBRARIES]
- 
- basic options:
- 
-   --help                            this message
-   --about                           print pkgconf version and license to stdout
-   --version                         print supported pkg-config version to stdout
-   --atleast-pkgconfig-version       check whether or not pkgconf is compatible
-                                     with a specified pkg-config version
-   --errors-to-stdout                print all errors on stdout instead of stderr
-   --print-errors                    ensure all errors are printed
-   --short-errors                    be less verbose about some errors
-   --silence-errors                  explicitly be silent about errors
-   --list-all                        list all known packages
-   --list-package-names              list all known package names
-   --simulate                        simulate walking the calculated dependency graph
-   --no-cache                        do not cache already seen packages when
-                                     walking the dependency graph
-   --log-file=filename               write an audit log to a specified file
-   --with-path=path                  adds a directory to the search path
-   --define-prefix                   override the prefix variable with one that is guessed based on
-                                     the location of the .pc file
-   --dont-define-prefix              do not override the prefix variable under any circumstances
-   --prefix-variable=varname         sets the name of the variable that pkgconf considers
-                                     to be the package prefix
-   --relocate=path                   relocates a path and exits (mostly for testsuite)
-   --dont-relocate-paths             disables path relocation support
- 
- cross-compilation personality support:
- 
-   --personality=triplet|filename    sets the personality to 'triplet' or a file named 'filename'
-   --dump-personality                dumps details concerning selected personality
- 
- checking specific pkg-config database entries:
- 
-   --atleast-version                 require a specific version of a module
-   --exact-version                   require an exact version of a module
-   --max-version                     require a maximum version of a module
-   --exists                          check whether or not a module exists
-   --uninstalled                     check whether or not an uninstalled module will be used
-   --no-uninstalled                  never use uninstalled modules when satisfying dependencies
-   --no-provides                     do not use 'provides' rules to resolve dependencies
-   --maximum-traverse-depth          maximum allowed depth for dependency graph
-   --static                          be more aggressive when computing dependency graph
-                                     (for static linking)
-   --shared                          use a simplified dependency graph (usually default)
-   --pure                            optimize a static dependency graph as if it were a normal
-                                     dependency graph
-   --env-only                        look only for package entries in PKG_CONFIG_PATH
-   --ignore-conflicts                ignore 'conflicts' rules in modules
-   --validate                        validate specific .pc files for correctness
- 
- querying specific pkg-config database fields:
- 
-   --define-variable=varname=value   define variable 'varname' as 'value'
-   --variable=varname                print specified variable entry to stdout
-   --cflags                          print required CFLAGS to stdout
-   --cflags-only-I                   print required include-dir CFLAGS to stdout
-   --cflags-only-other               print required non-include-dir CFLAGS to stdout
-   --libs                            print required linker flags to stdout
-   --libs-only-L                     print required LDPATH linker flags to stdout
-   --libs-only-l                     print required LIBNAME linker flags to stdout
-   --libs-only-other                 print required other linker flags to stdout
-   --print-requires                  print required dependency frameworks to stdout
-   --print-requires-private          print required dependency frameworks for static
-                                     linking to stdout
-   --print-provides                  print provided dependencies to stdout
-   --print-variables                 print all known variables in module to stdout
-   --digraph                         print entire dependency graph in graphviz 'dot' format
-   --keep-system-cflags              keep -I/usr/include entries in cflags output
-   --keep-system-libs                keep -L/lib:/lib/i386-linux-gnu:/lib/x86_64-linux-gnu:/lib/x86_64-linux-gnux32:/lib32:/libx32:/usr/lib:/usr/lib/i386-linux-gnu:/usr/lib/x86_64-linux-gnu:/usr/lib/x86_64-linux-gnux32:/usr/lib32:/usr/libx32 entries in libs output
-   --path                            show the exact filenames for any matching .pc files
-   --modversion                      print the specified module's version to stdout
-   --internal-cflags                 do not filter 'internal' cflags from output
- 
- filtering output:
- 
-   --msvc-syntax                     print translatable fragments in MSVC syntax
-   --fragment-filter=types           filter output fragments to the specified types
- 
- report bugs to <https://github.com/pkgconf/pkgconf/issues/new>.
-> compiled  conf-pkg-config.4
Processing 15/108: [ctypes.0.23.0, ctypes-foreign.0.23.0: extract] [dune.3.19.1, dune-configurator.3.19.1: extract] [guile.1.0: http] [conf-bash: bash] [conf-gmp: sh]
-> installed conf-pkg-config.4
Processing 16/108: [ctypes.0.23.0, ctypes-foreign.0.23.0: extract] [dune.3.19.1, dune-configurator.3.19.1: extract] [guile.1.0: http] [conf-bash: bash] [conf-gmp: sh]
Processing 17/108: [ctypes.0.23.0, ctypes-foreign.0.23.0: extract] [dune.3.19.1, dune-configurator.3.19.1: extract] [guile.1.0: http] [conf-bash: bash] [conf-gmp: sh] [conf-guile: pkg-config guile-3.0]
Processing 18/108: [ctypes.0.23.0, ctypes-foreign.0.23.0: extract] [dune.3.19.1, dune-configurator.3.19.1: extract] [guile.1.0: http] [conf-bash: bash] [conf-gmp: sh] [conf-guile: pkg-config guile-3.0] [conf-libffi: pkg-config libffi]
+ /home/opam/.opam/opam-init/hooks/sandbox.sh "build" "bash" "--version" (CWD=/home/opam/.opam/5.2.0+flambda2/.opam-switch/build/conf-bash.1)
- GNU bash, version 5.2.37(1)-release (x86_64-pc-linux-gnu)
- Copyright (C) 2022 Free Software Foundation, Inc.
- License GPLv3+: GNU GPL version 3 or later <http://gnu.org/licenses/gpl.html>
- 
- This is free software; you are free to change and redistribute it.
- There is NO WARRANTY, to the extent permitted by law.
-> compiled  conf-bash.1
Processing 18/108: [ctypes.0.23.0, ctypes-foreign.0.23.0: extract] [dune.3.19.1, dune-configurator.3.19.1: extract] [guile.1.0: http] [conf-gmp: sh] [conf-guile: pkg-config guile-3.0] [conf-libffi: pkg-config libffi]
-> installed conf-bash.1
Processing 19/108: [ctypes.0.23.0, ctypes-foreign.0.23.0: extract] [dune.3.19.1, dune-configurator.3.19.1: extract] [guile.1.0: http] [conf-gmp: sh] [conf-guile: pkg-config guile-3.0] [conf-libffi: pkg-config libffi]
+ /home/opam/.opam/opam-init/hooks/sandbox.sh "build" "sh" "-c" "pkg-config --print-errors --exists gmp || cc -c $CFLAGS -I/usr/local/include test.c" (CWD=/home/opam/.opam/5.2.0+flambda2/.opam-switch/build/conf-gmp.5)
-> compiled  conf-gmp.5
Processing 19/108: [ctypes.0.23.0, ctypes-foreign.0.23.0: extract] [dune.3.19.1, dune-configurator.3.19.1: extract] [guile.1.0: http] [conf-guile: pkg-config guile-3.0] [conf-libffi: pkg-config libffi]
-> installed conf-gmp.5
Processing 20/108: [ctypes.0.23.0, ctypes-foreign.0.23.0: extract] [dune.3.19.1, dune-configurator.3.19.1: extract] [guile.1.0: http] [conf-guile: pkg-config guile-3.0] [conf-libffi: pkg-config libffi]
-> retrieved ctypes.0.23.0, ctypes-foreign.0.23.0  (cached)
Processing 20/108: [dune.3.19.1, dune-configurator.3.19.1: extract] [guile.1.0: http] [conf-guile: pkg-config guile-3.0] [conf-libffi: pkg-config libffi]
Processing 21/108: [dune.3.19.1, dune-configurator.3.19.1: extract] [guile.1.0: http] [integers.0.7.0: extract] [conf-guile: pkg-config guile-3.0] [conf-libffi: pkg-config libffi]
+ /home/opam/.opam/opam-init/hooks/sandbox.sh "build" "pkg-config" "guile-3.0" (CWD=/home/opam/.opam/5.2.0+flambda2/.opam-switch/build/conf-guile.1)
-> compiled  conf-guile.1
Processing 21/108: [dune.3.19.1, dune-configurator.3.19.1: extract] [guile.1.0: http] [integers.0.7.0: extract] [conf-libffi: pkg-config libffi]
-> installed conf-guile.1
Processing 22/108: [dune.3.19.1, dune-configurator.3.19.1: extract] [guile.1.0: http] [integers.0.7.0: extract] [conf-libffi: pkg-config libffi]
+ /home/opam/.opam/opam-init/hooks/sandbox.sh "build" "pkg-config" "libffi" (CWD=/home/opam/.opam/5.2.0+flambda2/.opam-switch/build/conf-libffi.2.0.0)
-> compiled  conf-libffi.2.0.0
Processing 22/108: [dune.3.19.1, dune-configurator.3.19.1: extract] [guile.1.0: http] [integers.0.7.0: extract]
-> installed conf-libffi.2.0.0
Processing 23/108: [dune.3.19.1, dune-configurator.3.19.1: extract] [guile.1.0: http] [integers.0.7.0: extract]
-> retrieved integers.0.7.0  (cached)
Processing 23/108: [dune.3.19.1, dune-configurator.3.19.1: extract] [guile.1.0: http]
Processing 24/108: [dune.3.19.1, dune-configurator.3.19.1: extract] [guile.1.0: http] [num.1.6: extract]
-> retrieved num.1.6  (cached)
Processing 24/108: [dune.3.19.1, dune-configurator.3.19.1: extract] [guile.1.0: http]
Processing 25/108: [dune.3.19.1, dune-configurator.3.19.1: extract] [guile.1.0: http] [ocaml-compiler-libs.v0.17.0+ox: extract]
Processing 26/108: [dune.3.19.1, dune-configurator.3.19.1: extract] [guile.1.0: http] [ocaml-compiler-libs.v0.17.0+ox: extract] [num: make opam-modern]
-> retrieved ocaml-compiler-libs.v0.17.0+ox  (cached)
Processing 26/108: [dune.3.19.1, dune-configurator.3.19.1: extract] [guile.1.0: http] [num: make opam-modern]
Processing 27/108: [dune.3.19.1, dune-configurator.3.19.1: extract] [guile.1.0: http] [ocaml_intrinsics_kernel.v0.18~preview.130.36+326: extract] [num: make opam-modern]
-> retrieved ocaml_intrinsics_kernel.v0.18~preview.130.36+326  (cached)
Processing 27/108: [dune.3.19.1, dune-configurator.3.19.1: extract] [guile.1.0: http] [num: make opam-modern]
Processing 28/108: [dune.3.19.1, dune-configurator.3.19.1: extract] [guile.1.0: http] [parsexp.v0.18~preview.130.36+326: extract] [num: make opam-modern]
-> retrieved parsexp.v0.18~preview.130.36+326  (cached)
Processing 28/108: [dune.3.19.1, dune-configurator.3.19.1: extract] [guile.1.0: http] [num: make opam-modern]
Processing 29/108: [dune.3.19.1, dune-configurator.3.19.1: extract] [guile.1.0: http] [ppx_base.v0.18~preview.130.36+326: extract] [num: make opam-modern]
-> retrieved ppx_base.v0.18~preview.130.36+326  (cached)
Processing 29/108: [dune.3.19.1, dune-configurator.3.19.1: extract] [guile.1.0: http] [num: make opam-modern]
Processing 30/108: [dune.3.19.1, dune-configurator.3.19.1: extract] [guile.1.0: http] [ppx_cold.v0.18~preview.130.36+326: extract] [num: make opam-modern]
-> retrieved ppx_cold.v0.18~preview.130.36+326  (cached)
Processing 30/108: [dune.3.19.1, dune-configurator.3.19.1: extract] [guile.1.0: http] [num: make opam-modern]
Processing 31/108: [dune.3.19.1, dune-configurator.3.19.1: extract] [guile.1.0: http] [ppx_compare.v0.18~preview.130.36+326: extract] [num: make opam-modern]
Processing 31/108: [dune.3.19.1, dune-configurator.3.19.1: extract] [guile.1.0: extract] [ppx_compare.v0.18~preview.130.36+326: extract] [num: make opam-modern]
-> retrieved ppx_compare.v0.18~preview.130.36+326  (cached)
Processing 31/108: [dune.3.19.1, dune-configurator.3.19.1: extract] [guile.1.0: extract] [num: make opam-modern]
Processing 32/108: [dune.3.19.1, dune-configurator.3.19.1: extract] [guile.1.0: extract] [ppx_derivers.1.2.1: extract] [num: make opam-modern]
-> retrieved guile.1.0  (https://github.com/gopiandcode/guile-ocaml/archive/1.0.tar.gz)
Processing 32/108: [dune.3.19.1, dune-configurator.3.19.1: extract] [ppx_derivers.1.2.1: extract] [num: make opam-modern]
Processing 33/108: [dune.3.19.1, dune-configurator.3.19.1: extract] [ppx_derivers.1.2.1: extract] [ppx_enumerate.v0.18~preview.130.36+326: extract] [num: make opam-modern]
-> retrieved ppx_derivers.1.2.1  (cached)
Processing 33/108: [dune.3.19.1, dune-configurator.3.19.1: extract] [ppx_enumerate.v0.18~preview.130.36+326: extract] [num: make opam-modern]
Processing 34/108: [dune.3.19.1, dune-configurator.3.19.1: extract] [ppx_enumerate.v0.18~preview.130.36+326: extract] [ppx_globalize.v0.18~preview.130.36+326: extract] [num: make opam-modern]
-> retrieved ppx_enumerate.v0.18~preview.130.36+326  (cached)
Processing 34/108: [dune.3.19.1, dune-configurator.3.19.1: extract] [ppx_globalize.v0.18~preview.130.36+326: extract] [num: make opam-modern]
Processing 35/108: [dune.3.19.1, dune-configurator.3.19.1: extract] [ppx_globalize.v0.18~preview.130.36+326: extract] [ppx_hash.v0.18~preview.130.36+326: extract] [num: make opam-modern]
-> retrieved ppx_globalize.v0.18~preview.130.36+326  (cached)
Processing 35/108: [dune.3.19.1, dune-configurator.3.19.1: extract] [ppx_hash.v0.18~preview.130.36+326: extract] [num: make opam-modern]
Processing 36/108: [dune.3.19.1, dune-configurator.3.19.1: extract] [ppx_hash.v0.18~preview.130.36+326: extract] [ppx_helpers.v0.18~preview.130.36+326: extract] [num: make opam-modern]
-> retrieved ppx_hash.v0.18~preview.130.36+326  (cached)
Processing 36/108: [dune.3.19.1, dune-configurator.3.19.1: extract] [ppx_helpers.v0.18~preview.130.36+326: extract] [num: make opam-modern]
Processing 37/108: [dune.3.19.1, dune-configurator.3.19.1: extract] [ppx_helpers.v0.18~preview.130.36+326: extract] [ppx_sexp_conv.v0.18~preview.130.36+326: extract] [num: make opam-modern]
-> retrieved ppx_helpers.v0.18~preview.130.36+326  (cached)
Processing 37/108: [dune.3.19.1, dune-configurator.3.19.1: extract] [ppx_sexp_conv.v0.18~preview.130.36+326: extract] [num: make opam-modern]
Processing 38/108: [dune.3.19.1, dune-configurator.3.19.1: extract] [ppx_sexp_conv.v0.18~preview.130.36+326: extract] [ppx_shorthand.v0.18~preview.130.36+326: extract] [num: make opam-modern]
-> retrieved ppx_shorthand.v0.18~preview.130.36+326  (cached)
Processing 38/108: [dune.3.19.1, dune-configurator.3.19.1: extract] [ppx_sexp_conv.v0.18~preview.130.36+326: extract] [num: make opam-modern]
Processing 39/108: [dune.3.19.1, dune-configurator.3.19.1: extract] [ppx_sexp_conv.v0.18~preview.130.36+326: extract] [ppx_template.v0.18~preview.130.36+326: extract] [num: make opam-modern]
-> retrieved ppx_sexp_conv.v0.18~preview.130.36+326  (cached)
Processing 39/108: [dune.3.19.1, dune-configurator.3.19.1: extract] [ppx_template.v0.18~preview.130.36+326: extract] [num: make opam-modern]
Processing 40/108: [dune.3.19.1, dune-configurator.3.19.1: extract] [ppx_template.v0.18~preview.130.36+326: extract] [ppxlib.0.33.0+ox, ppxlib_ast.0.33.0+ox: extract] [num: make opam-modern]
-> retrieved ppx_template.v0.18~preview.130.36+326  (cached)
Processing 40/108: [dune.3.19.1, dune-configurator.3.19.1: extract] [ppxlib.0.33.0+ox, ppxlib_ast.0.33.0+ox: extract] [num: make opam-modern]
Processing 41/108: [dune.3.19.1, dune-configurator.3.19.1: extract] [ppxlib.0.33.0+ox, ppxlib_ast.0.33.0+ox: extract] [ppxlib_jane.v0.18~preview.130.36+326: extract] [num: make opam-modern]
-> retrieved ppxlib_jane.v0.18~preview.130.36+326  (cached)
Processing 41/108: [dune.3.19.1, dune-configurator.3.19.1: extract] [ppxlib.0.33.0+ox, ppxlib_ast.0.33.0+ox: extract] [num: make opam-modern]
Processing 42/108: [dune.3.19.1, dune-configurator.3.19.1: extract] [ppxlib.0.33.0+ox, ppxlib_ast.0.33.0+ox: extract] [sexplib.v0.18~preview.130.36+326: extract] [num: make opam-modern]
-> retrieved ppxlib.0.33.0+ox, ppxlib_ast.0.33.0+ox  (cached)
Processing 42/108: [dune.3.19.1, dune-configurator.3.19.1: extract] [sexplib.v0.18~preview.130.36+326: extract] [num: make opam-modern]
Processing 43/108: [dune.3.19.1, dune-configurator.3.19.1: extract] [sexplib.v0.18~preview.130.36+326: extract] [sexplib0.v0.18~preview.130.36+326: extract] [num: make opam-modern]
-> retrieved sexplib.v0.18~preview.130.36+326  (cached)
Processing 43/108: [dune.3.19.1, dune-configurator.3.19.1: extract] [sexplib0.v0.18~preview.130.36+326: extract] [num: make opam-modern]
Processing 44/108: [dune.3.19.1, dune-configurator.3.19.1: extract] [sexplib0.v0.18~preview.130.36+326: extract] [stdio.v0.18~preview.130.36+326: extract] [num: make opam-modern]
-> retrieved sexplib0.v0.18~preview.130.36+326  (cached)
Processing 44/108: [dune.3.19.1, dune-configurator.3.19.1: extract] [stdio.v0.18~preview.130.36+326: extract] [num: make opam-modern]
Processing 45/108: [dune.3.19.1, dune-configurator.3.19.1: extract] [stdio.v0.18~preview.130.36+326: extract] [stdlib-shims.0.3.0: extract] [num: make opam-modern]
-> retrieved stdio.v0.18~preview.130.36+326  (cached)
Processing 45/108: [dune.3.19.1, dune-configurator.3.19.1: extract] [stdlib-shims.0.3.0: extract] [num: make opam-modern]
-> retrieved stdlib-shims.0.3.0  (cached)
Processing 45/108: [dune.3.19.1, dune-configurator.3.19.1: extract] [num: make opam-modern]
-> retrieved dune.3.19.1, dune-configurator.3.19.1  (cached)
Processing 45/108: [num: make opam-modern]
Processing 46/108: [dune: ocaml 71] [num: make opam-modern]
+ /home/opam/.opam/opam-init/hooks/sandbox.sh "build" "make" "PROFILE=release" "opam-modern" (CWD=/home/opam/.opam/5.2.0+flambda2/.opam-switch/build/num.1.6)
- make -C src all
- make[1]: Entering directory '/home/opam/.opam/5.2.0+flambda2/.opam-switch/build/num.1.6/src'
- ocamlc -ccopt -DBNG_ARCH_amd64 -c bng.c
- ocamlc -ccopt -DBNG_ARCH_amd64 -c nat_stubs.c
- ocamlmklib -oc nums bng.o nat_stubs.o
- ocamlc -w +a-4-9-41-42-44-45-48  -bin-annot -g -safe-string -strict-sequence -strict-formats -I +compiler-libs -c int_misc.mli
- ocamlc -w +a-4-9-41-42-44-45-48  -bin-annot -g -safe-string -strict-sequence -strict-formats -I +compiler-libs -c int_misc.ml
- ocamlc -w +a-4-9-41-42-44-45-48  -bin-annot -g -safe-string -strict-sequence -strict-formats -I +compiler-libs -c nat.mli
- ocamlc -w +a-4-9-41-42-44-45-48  -bin-annot -g -safe-string -strict-sequence -strict-formats -I +compiler-libs -c nat.ml
- ocamlc -w +a-4-9-41-42-44-45-48  -bin-annot -g -safe-string -strict-sequence -strict-formats -I +compiler-libs -c big_int.mli
- ocamlc -w +a-4-9-41-42-44-45-48  -bin-annot -g -safe-string -strict-sequence -strict-formats -I +compiler-libs -c big_int.ml
- ocamlc -w +a-4-9-41-42-44-45-48  -bin-annot -g -safe-string -strict-sequence -strict-formats -I +compiler-libs -c arith_flags.mli
- ocamlc -w +a-4-9-41-42-44-45-48  -bin-annot -g -safe-string -strict-sequence -strict-formats -I +compiler-libs -c arith_flags.ml
- ocamlc -w +a-4-9-41-42-44-45-48  -bin-annot -g -safe-string -strict-sequence -strict-formats -I +compiler-libs -c ratio.mli
- ocamlc -w +a-4-9-41-42-44-45-48  -bin-annot -g -safe-string -strict-sequence -strict-formats -I +compiler-libs -c ratio.ml
- ocamlc -w +a-4-9-41-42-44-45-48  -bin-annot -g -safe-string -strict-sequence -strict-formats -I +compiler-libs -c num.mli
- ocamlc -w +a-4-9-41-42-44-45-48  -bin-annot -g -safe-string -strict-sequence -strict-formats -I +compiler-libs -c num.ml
- ocamlc -w +a-4-9-41-42-44-45-48  -bin-annot -g -safe-string -strict-sequence -strict-formats -I +compiler-libs -c arith_status.mli
- ocamlc -w +a-4-9-41-42-44-45-48  -bin-annot -g -safe-string -strict-sequence -strict-formats -I +compiler-libs -c arith_status.ml
- ocamlmklib -o nums -oc nums -linkall int_misc.cmo nat.cmo big_int.cmo arith_flags.cmo ratio.cmo num.cmo arith_status.cmo
- cp ../toplevel/num_top_printers.mli ../toplevel/num_top.mli ../toplevel/num_top_printers.ml ../toplevel/num_top.ml .
- ocamlc -w +a-4-9-41-42-44-45-48  -bin-annot -g -safe-string -strict-sequence -strict-formats -I +compiler-libs -c num_top_printers.mli
- ocamlc -w +a-4-9-41-42-44-45-48  -bin-annot -g -safe-string -strict-sequence -strict-formats -I +compiler-libs -c num_top_printers.ml
- ocamlc -w +a-4-9-41-42-44-45-48  -bin-annot -g -safe-string -strict-sequence -strict-formats -I +compiler-libs -c num_top.mli
- ocamlc -w +a-4-9-41-42-44-45-48  -bin-annot -g -safe-string -strict-sequence -strict-formats -I +compiler-libs -c num_top.ml
- ocamlc -w +a-4-9-41-42-44-45-48  -bin-annot -g -safe-string -strict-sequence -strict-formats -I +compiler-libs -a -o num_top.cma num_top_printers.cmo num_top.cmo
- echo 'version = "1.7~dev"' > META.top
- cat META.num-top.in >> META.top
- ocamlopt -w +a-4-9-41-42-44-45-48  -bin-annot -g -safe-string -strict-sequence -strict-formats -I +compiler-libs -c int_misc.ml
- ocamlopt -w +a-4-9-41-42-44-45-48  -bin-annot -g -safe-string -strict-sequence -strict-formats -I +compiler-libs -c nat.ml
- ocamlopt -w +a-4-9-41-42-44-45-48  -bin-annot -g -safe-string -strict-sequence -strict-formats -I +compiler-libs -c big_int.ml
- ocamlopt -w +a-4-9-41-42-44-45-48  -bin-annot -g -safe-string -strict-sequence -strict-formats -I +compiler-libs -c arith_flags.ml
- ocamlopt -w +a-4-9-41-42-44-45-48  -bin-annot -g -safe-string -strict-sequence -strict-formats -I +compiler-libs -c ratio.ml
- ocamlopt -w +a-4-9-41-42-44-45-48  -bin-annot -g -safe-string -strict-sequence -strict-formats -I +compiler-libs -c num.ml
- ocamlopt -w +a-4-9-41-42-44-45-48  -bin-annot -g -safe-string -strict-sequence -strict-formats -I +compiler-libs -c arith_status.ml
- ocamlmklib -o nums -oc nums -linkall int_misc.cmx nat.cmx big_int.cmx arith_flags.cmx ratio.cmx num.cmx arith_status.cmx
- ocamlopt -w +a-4-9-41-42-44-45-48  -bin-annot -g -safe-string -strict-sequence -strict-formats -I +compiler-libs -I . -shared -o nums.cmxs nums.cmxa
- make[1]: Leaving directory '/home/opam/.opam/5.2.0+flambda2/.opam-switch/build/num.1.6/src'
- cp src/num-modern.install num.install
-> compiled  num.1.6
Processing 46/108: [dune: ocaml 71]
-> installed num.1.6
Processing 47/108: [dune: ocaml 71]
+ /home/opam/.opam/opam-init/hooks/sandbox.sh "build" "ocaml" "boot/bootstrap.ml" "-j" "71" (CWD=/home/opam/.opam/5.2.0+flambda2/.opam-switch/build/dune.3.19.1)
- ocamlc -output-complete-exe -w -24 -g -o .duneboot.exe -I boot -I +unix unix.cma boot/libs.ml boot/duneboot.ml
- ./.duneboot.exe -j 71
- cd _boot && /home/opam/.opam/5.2.0+flambda2/bin/ocamlopt.opt -c -g -no-alias-deps -w -49-6 -alert -unstable -I +unix -I +threads ocamlc_loc.mli
- File "otherlibs/ocamlc-loc/src/ocamlc_loc.mli", line 1, characters 4-9:
- Warning 53 [misplaced-attribute]: the "alert" attribute cannot appear in this context
- cd _boot && /home/opam/.opam/5.2.0+flambda2/bin/ocamlopt.opt -c -g -no-alias-deps -w -49-6 -alert -unstable -I +unix -I +threads stdune__Code_error.ml
- File "otherlibs/stdune/src/code_error.ml", line 29, characters 2-27:
- Alert unsafe_multidomain: Stdlib.Printexc.register_printer
- Use [Printexc.Safe.register_printer].
- cd _boot && /home/opam/.opam/5.2.0+flambda2/bin/ocamlopt.opt -c -g -no-alias-deps -w -49-6 -alert -unstable -I +unix -I +threads notty_unix.ml
- File "vendor/notty/src-unix/notty_unix.ml", line 38, characters 23-29:
- Alert unsafe_multidomain: Stdlib.Sys.signal
- Use [Sys.Safe.signal].
- 
- File "vendor/notty/src-unix/notty_unix.ml", line 39, characters 31-45:
- Alert unsafe_multidomain: Stdlib.Sys.set_signal
- Use [Sys.Safe.set_signal].
- cd _boot && /home/opam/.opam/5.2.0+flambda2/bin/ocamlopt.opt -c -g -no-alias-deps -w -49-6 -alert -unstable -I +unix -I +threads stdune__User_error.ml
- File "otherlibs/stdune/src/user_error.ml", line 17, characters 2-27:
- Alert unsafe_multidomain: Stdlib.Printexc.register_printer
- Use [Printexc.Safe.register_printer].
- cd _boot && /home/opam/.opam/5.2.0+flambda2/bin/ocamlopt.opt -c -g -no-alias-deps -w -49-6 -alert -unstable -I +unix -I +threads opamStd.ml
- File "vendor/opam/src/core/opamStd.ml", line 960, characters 10-24:
- Alert unsafe_multidomain: Stdlib.Sys.set_signal
- Use [Sys.Safe.set_signal].
- cd _boot && /home/opam/.opam/5.2.0+flambda2/bin/ocamlopt.opt -c -g -no-alias-deps -w -49-6 -alert -unstable -I +unix -I +threads dune_rpc_private__Conv.ml
- File "otherlibs/dune-rpc/private/conv.ml", line 48, characters 2-27:
- Alert unsafe_multidomain: Stdlib.Printexc.register_printer
- Use [Printexc.Safe.register_printer].
- cd _boot && /home/opam/.opam/5.2.0+flambda2/bin/ocamlopt.opt -c -g -no-alias-deps -w -49-6 -alert -unstable -I +unix -I +threads dune_rpc_private__Where.ml
- File "otherlibs/dune-rpc/private/where.ml", line 22, characters 2-27:
- Alert unsafe_multidomain: Stdlib.Printexc.register_printer
- Use [Printexc.Safe.register_printer].
- cd _boot && /home/opam/.opam/5.2.0+flambda2/bin/ocamlopt.opt -c -g -no-alias-deps -w -49-6 -alert -unstable -I +unix -I +threads dune_rpc_private__Registry.ml
- File "otherlibs/dune-rpc/private/registry.ml", line 67, characters 4-29:
- Alert unsafe_multidomain: Stdlib.Printexc.register_printer
- Use [Printexc.Safe.register_printer].
- cd _boot && /home/opam/.opam/5.2.0+flambda2/bin/ocamlopt.opt -c -g -no-alias-deps -w -49-6 -alert -unstable -I +unix -I +threads dune_rpc_private__Types.ml
- File "otherlibs/dune-rpc/private/types.ml", line 154, characters 6-31:
- Alert unsafe_multidomain: Stdlib.Printexc.register_printer
- Use [Printexc.Safe.register_printer].
- cd _boot && /home/opam/.opam/5.2.0+flambda2/bin/ocamlopt.opt -c -g -no-alias-deps -w -49-6 -alert -unstable -I +unix -I +threads dune_rpc_private__Versioned.ml
- File "otherlibs/dune-rpc/private/versioned.ml", line 23, characters 4-29:
- Alert unsafe_multidomain: Stdlib.Printexc.register_printer
- Use [Printexc.Safe.register_printer].
- cd _boot && /home/opam/.opam/5.2.0+flambda2/bin/ocamlopt.opt -c -g -no-alias-deps -w -49-6 -alert -unstable -I +unix -I +threads memo.ml
- File "src/memo/memo.ml", line 414, characters 2-27:
- Alert unsafe_multidomain: Stdlib.Printexc.register_printer
- Use [Printexc.Safe.register_printer].
- cd _boot && /home/opam/.opam/5.2.0+flambda2/bin/ocamlopt.opt -c -g -no-alias-deps -w -49-6 -alert -unstable -I +unix -I +threads opamSystem.ml
- File "vendor/opam/src/core/opamSystem.ml", line 1248, characters 2-27:
- Alert unsafe_multidomain: Stdlib.Printexc.register_printer
- Use [Printexc.Safe.register_printer].
- 
- File "vendor/opam/src/core/opamSystem.ml", line 1264, characters 6-20:
- Alert unsafe_multidomain: Stdlib.Sys.set_signal
- Use [Sys.Safe.set_signal].
- cd _boot && /home/opam/.opam/5.2.0+flambda2/bin/ocamlopt.opt -c -g -no-alias-deps -w -49-6 -alert -unstable -I +unix -I +threads dune_rpc_private.ml
- File "otherlibs/dune-rpc/private/dune_rpc_private.ml", line 200, characters 6-31:
- Alert unsafe_multidomain: Stdlib.Printexc.register_printer
- Use [Printexc.Safe.register_printer].
- cd _boot && /home/opam/.opam/5.2.0+flambda2/bin/ocamlopt.opt -c -g -no-alias-deps -w -49-6 -alert -unstable -I +unix -I +threads dune_action_plugin.mli
- File "otherlibs/dune-action-plugin/src/dune_action_plugin.mli", line 1, characters 4-9:
- Warning 53 [misplaced-attribute]: the "alert" attribute cannot appear in this context
- cd _boot && /home/opam/.opam/5.2.0+flambda2/bin/ocamlopt.opt -c -g -no-alias-deps -w -49-6 -alert -unstable -I +unix -I +threads dune_rpc_server.ml
- File "src/dune_rpc_server/dune_rpc_server.ml", line 15, characters 2-27:
- Alert unsafe_multidomain: Stdlib.Printexc.register_printer
- Use [Printexc.Safe.register_printer].
- cd _boot && /home/opam/.opam/5.2.0+flambda2/bin/ocamlopt.opt -c -g -no-alias-deps -w -49-6 -alert -unstable -I +unix -I +threads dune_engine__Scheduler.ml
- File "src/dune_engine/scheduler.ml", line 54, characters 4-29:
- Alert unsafe_multidomain: Stdlib.Printexc.register_printer
- Use [Printexc.Safe.register_printer].
- 
- File "src/dune_engine/scheduler.ml", line 632, characters 6-20:
- Alert unsafe_multidomain: Dune_engine__.Import.Sys.set_signal
- Use [Sys.Safe.set_signal].
- cd _boot && /home/opam/.opam/5.2.0+flambda2/bin/ocamlopt.opt -c -g -no-alias-deps -w -49-6 -alert -unstable -I +unix -I +threads opamPp.ml
- File "vendor/opam/src/format/opamPp.ml", line 64, characters 9-34:
- Alert unsafe_multidomain: Stdlib.Printexc.register_printer
- Use [Printexc.Safe.register_printer].
- cd _boot && /home/opam/.opam/5.2.0+flambda2/bin/ocamlopt.opt -c -g -no-alias-deps -w -49-6 -alert -unstable -I +unix -I +threads dune_tui.ml
- File "src/dune_tui/dune_tui.ml", line 14, characters 7-21:
- Alert unsafe_multidomain: Dune_tui__.Import.Sys.set_signal
- Use [Sys.Safe.set_signal].
- 
- File "src/dune_tui/dune_tui.ml", line 22, characters 12-22:
- Alert unsafe_multidomain: Dune_tui__.Import.Sys.signal
- Use [Sys.Safe.signal].
- 

Processing 47/108: [dune: ./_boot/dune.exe build]
+ /home/opam/.opam/opam-init/hooks/sandbox.sh "build" "./_boot/dune.exe" "build" "dune.install" "--release" "--profile" "dune-bootstrap" "-j" "71" (CWD=/home/opam/.opam/5.2.0+flambda2/.opam-switch/build/dune.3.19.1)
-> compiled  dune.3.19.1
-> installed dune.3.19.1
Processing 49/108: [basement: dune build]
Processing 50/108: [basement: dune build] [bigarray-compat: dune build]
Processing 51/108: [basement: dune build] [bigarray-compat: dune build] [csexp: dune build]
[ocaml-compiler-libs: patch] applying read_cma.patch
Processing 52/108: [basement: dune build] [bigarray-compat: dune build] [csexp: dune build] [ocaml-compiler-libs: dune build]
Processing 53/108: [basement: dune build] [bigarray-compat: dune build] [csexp: dune build] [ocaml-compiler-libs: dune build] [ocaml_intrinsics_kernel: dune build]
Processing 54/108: [basement: dune build] [bigarray-compat: dune build] [csexp: dune build] [ocaml-compiler-libs: dune build] [ocaml_intrinsics_kernel: dune build] [ppx_derivers: dune build]
Processing 55/108: [basement: dune build] [bigarray-compat: dune build] [csexp: dune build] [ocaml-compiler-libs: dune build] [ocaml_intrinsics_kernel: dune build] [ppx_derivers: dune build] [stdlib-shims: dune build]
+ /home/opam/.opam/opam-init/hooks/sandbox.sh "build" "dune" "build" "-p" "ppx_derivers" "-j" "71" (CWD=/home/opam/.opam/5.2.0+flambda2/.opam-switch/build/ppx_derivers.1.2.1)
-> compiled  ppx_derivers.1.2.1
Processing 55/108: [basement: dune build] [bigarray-compat: dune build] [csexp: dune build] [ocaml-compiler-libs: dune build] [ocaml_intrinsics_kernel: dune build] [stdlib-shims: dune build]
-> installed ppx_derivers.1.2.1
Processing 56/108: [basement: dune build] [bigarray-compat: dune build] [csexp: dune build] [ocaml-compiler-libs: dune build] [ocaml_intrinsics_kernel: dune build] [stdlib-shims: dune build]
+ /home/opam/.opam/opam-init/hooks/sandbox.sh "build" "dune" "build" "-p" "ocaml_intrinsics_kernel" "-j" "71" (CWD=/home/opam/.opam/5.2.0+flambda2/.opam-switch/build/ocaml_intrinsics_kernel.v0.18~preview.130.36+326)
-> compiled  ocaml_intrinsics_kernel.v0.18~preview.130.36+326
Processing 56/108: [basement: dune build] [bigarray-compat: dune build] [csexp: dune build] [ocaml-compiler-libs: dune build] [stdlib-shims: dune build]
-> installed ocaml_intrinsics_kernel.v0.18~preview.130.36+326
Processing 57/108: [basement: dune build] [bigarray-compat: dune build] [csexp: dune build] [ocaml-compiler-libs: dune build] [stdlib-shims: dune build]
+ /home/opam/.opam/opam-init/hooks/sandbox.sh "build" "dune" "build" "-p" "csexp" "-j" "71" "@install" (CWD=/home/opam/.opam/5.2.0+flambda2/.opam-switch/build/csexp.1.5.2)
- (cd _build/default && /home/opam/.opam/5.2.0+flambda2/bin/ocamlc.opt -w -40 -g -bin-annot -bin-annot-occurrences -I src/.csexp.objs/byte -intf-suffix .ml -no-alias-deps -o src/.csexp.objs/byte/csexp.cmo -c -impl src/csexp.ml)
- File "src/csexp.ml", line 236, characters 7-14:
- 236 |     [@@inlined always]
-              ^^^^^^^
- Warning 53 [misplaced-attribute]: the "inlined" attribute cannot appear in this context
- (cd _build/default && /home/opam/.opam/5.2.0+flambda2/bin/ocamlopt.opt -w -40 -g -I src/.csexp.objs/byte -I src/.csexp.objs/native -intf-suffix .ml -no-alias-deps -o src/.csexp.objs/native/csexp.cmx -c -impl src/csexp.ml)
- File "src/csexp.ml", line 236, characters 7-14:
- 236 |     [@@inlined always]
-              ^^^^^^^
- Warning 53 [misplaced-attribute]: the "inlined" attribute cannot appear in this context
-> compiled  csexp.1.5.2
Processing 57/108: [basement: dune build] [bigarray-compat: dune build] [ocaml-compiler-libs: dune build] [stdlib-shims: dune build]
-> installed csexp.1.5.2
Processing 58/108: [basement: dune build] [bigarray-compat: dune build] [ocaml-compiler-libs: dune build] [stdlib-shims: dune build]
Processing 59/108: [basement: dune build] [bigarray-compat: dune build] [dune-configurator: rm] [ocaml-compiler-libs: dune build] [stdlib-shims: dune build]
+ /home/opam/.opam/opam-init/hooks/sandbox.sh "build" "dune" "build" "-p" "basement" "-j" "71" (CWD=/home/opam/.opam/5.2.0+flambda2/.opam-switch/build/basement.v0.18~preview.130.36+326)
- (cd _build/default && /home/opam/.opam/5.2.0+flambda2/bin/ocamlc.opt -w -40 -g -bin-annot -bin-annot-occurrences -I src/.basement.objs/byte -no-alias-deps -open Basement__ -o src/.basement.objs/byte/basement.cmo -c -impl src/basement.ml)
- File "src/basement.ml", line 10, characters 30-50:
- 10 | module Stdlib_shim_upstream = Stdlib_shim_upstream
-                                    ^^^^^^^^^^^^^^^^^^^^
- Warning 49 [no-cmi-file]: no cmi file was found in path for module Stdlib_shim_upstream
- (cd _build/default && /home/opam/.opam/5.2.0+flambda2/bin/ocamlopt.opt -w -40 -g -O3 -flambda2-inline-max-depth 10 -I src/.basement.objs/byte -I src/.basement.objs/native -intf-suffix .ml -no-alias-deps -open Basement__ -o src/.basement.objs/native/basement.cmx -c -impl src/basement.ml)
- File "src/basement.ml", line 10, characters 30-50:
- 10 | module Stdlib_shim_upstream = Stdlib_shim_upstream
-                                    ^^^^^^^^^^^^^^^^^^^^
- Warning 49 [no-cmi-file]: no cmi file was found in path for module Stdlib_shim_upstream
-> compiled  basement.v0.18~preview.130.36+326
Processing 59/108: [bigarray-compat: dune build] [dune-configurator: rm] [ocaml-compiler-libs: dune build] [stdlib-shims: dune build]
-> installed basement.v0.18~preview.130.36+326
Processing 60/108: [bigarray-compat: dune build] [dune-configurator: rm] [ocaml-compiler-libs: dune build] [stdlib-shims: dune build]
Processing 61/108: [bigarray-compat: dune build] [dune-configurator: rm] [ocaml-compiler-libs: dune build] [sexplib0: dune build] [stdlib-shims: dune build]
+ /home/opam/.opam/opam-init/hooks/sandbox.sh "build" "dune" "build" "-p" "bigarray-compat" "-j" "71" (CWD=/home/opam/.opam/5.2.0+flambda2/.opam-switch/build/bigarray-compat.1.1.0)
-> compiled  bigarray-compat.1.1.0
Processing 61/108: [dune-configurator: rm] [ocaml-compiler-libs: dune build] [sexplib0: dune build] [stdlib-shims: dune build]
-> installed bigarray-compat.1.1.0
Processing 62/108: [dune-configurator: rm] [ocaml-compiler-libs: dune build] [sexplib0: dune build] [stdlib-shims: dune build]
+ /home/opam/.opam/opam-init/hooks/sandbox.sh "build" "dune" "build" "-p" "stdlib-shims" "-j" "71" (CWD=/home/opam/.opam/5.2.0+flambda2/.opam-switch/build/stdlib-shims.0.3.0)
-> compiled  stdlib-shims.0.3.0
Processing 62/108: [dune-configurator: rm] [ocaml-compiler-libs: dune build] [sexplib0: dune build]
-> installed stdlib-shims.0.3.0
Processing 63/108: [dune-configurator: rm] [ocaml-compiler-libs: dune build] [sexplib0: dune build]
Processing 64/108: [dune-configurator: rm] [integers: dune build] [ocaml-compiler-libs: dune build] [sexplib0: dune build]
+ /home/opam/.opam/opam-init/hooks/sandbox.sh "build" "rm" "-rf" "vendor/csexp" (CWD=/home/opam/.opam/5.2.0+flambda2/.opam-switch/build/dune-configurator.3.19.1)
+ /home/opam/.opam/opam-init/hooks/sandbox.sh "build" "rm" "-rf" "vendor/pp" (CWD=/home/opam/.opam/5.2.0+flambda2/.opam-switch/build/dune-configurator.3.19.1)
Processing 64/108: [dune-configurator: dune build] [integers: dune build] [ocaml-compiler-libs: dune build] [sexplib0: dune build]
+ /home/opam/.opam/opam-init/hooks/sandbox.sh "build" "dune" "build" "-p" "ocaml-compiler-libs" "-j" "71" (CWD=/home/opam/.opam/5.2.0+flambda2/.opam-switch/build/ocaml-compiler-libs.v0.17.0+ox)
- (cd _build/default && /home/opam/.opam/5.2.0+flambda2/bin/ocamlc.opt -w -40 -safe-string -g -bin-annot -bin-annot-occurrences -I src/ocaml_toplevel/.ocaml_toplevel.objs/byte -I /home/opam/.opam/5.2.0+flambda2/lib/ocaml/compiler-libs -no-alias-deps -o src/ocaml_toplevel/.ocaml_toplevel.objs/byte/ocaml_toplevel.cmo -c -impl src/ocaml_toplevel/ocaml_toplevel.ml)
- File "src/ocaml_toplevel/ocaml_toplevel.ml", line 4, characters 21-30:
- 4 | module Topcommon   = Topcommon
-                          ^^^^^^^^^
- Warning 49 [no-cmi-file]: no cmi file was found in path for module Topcommon
- 
- File "src/ocaml_toplevel/ocaml_toplevel.ml", line 6, characters 21-28:
- 6 | module Topeval     = Topeval
-                          ^^^^^^^
- Warning 49 [no-cmi-file]: no cmi file was found in path for module Topeval
- 
- File "src/ocaml_toplevel/ocaml_toplevel.ml", line 9, characters 21-32:
- 9 | module Topprinters = Topprinters
-                          ^^^^^^^^^^^
- Warning 49 [no-cmi-file]: no cmi file was found in path for module Topprinters
- (cd _build/default && /home/opam/.opam/5.2.0+flambda2/bin/ocamlopt.opt -w -40 -safe-string -g -I src/ocaml_toplevel/.ocaml_toplevel.objs/byte -I src/ocaml_toplevel/.ocaml_toplevel.objs/native -I /home/opam/.opam/5.2.0+flambda2/lib/ocaml/compiler-libs -intf-suffix .ml -no-alias-deps -o src/ocaml_toplevel/.ocaml_toplevel.objs/native/ocaml_toplevel.cmx -c -impl src/ocaml_toplevel/ocaml_toplevel.ml)
- File "src/ocaml_toplevel/ocaml_toplevel.ml", line 4, characters 21-30:
- 4 | module Topcommon   = Topcommon
-                          ^^^^^^^^^
- Warning 49 [no-cmi-file]: no cmi file was found in path for module Topcommon
- 
- File "src/ocaml_toplevel/ocaml_toplevel.ml", line 6, characters 21-28:
- 6 | module Topeval     = Topeval
-                          ^^^^^^^
- Warning 49 [no-cmi-file]: no cmi file was found in path for module Topeval
- 
- File "src/ocaml_toplevel/ocaml_toplevel.ml", line 9, characters 21-32:
- 9 | module Topprinters = Topprinters
-                          ^^^^^^^^^^^
- Warning 49 [no-cmi-file]: no cmi file was found in path for module Topprinters
- (cd _build/default && /home/opam/.opam/5.2.0+flambda2/bin/ocamlc.opt -w -40 -safe-string -g -bin-annot -bin-annot-occurrences -I src/ocaml_optcomp/.ocaml_optcomp.objs/byte -I /home/opam/.opam/5.2.0+flambda2/lib/ocaml/compiler-libs -no-alias-deps -o src/ocaml_optcomp/.ocaml_optcomp.objs/byte/ocaml_optcomp.cmo -c -impl src/ocaml_optcomp/ocaml_optcomp.ml)
- File "src/ocaml_optcomp/ocaml_optcomp.ml", line 438, characters 68-95:
- 438 | module Oxcaml_utils__File_sections                                = Oxcaml_utils__File_sections
-                                                                           ^^^^^^^^^^^^^^^^^^^^^^^^^^^
- Warning 49 [no-cmi-file]: no cmi file was found in path for module Oxcaml_utils__File_sections
- 
- File "src/ocaml_optcomp/ocaml_optcomp.ml", line 439, characters 68-85:
- 439 | module Oxcaml_utils__Lru                                          = Oxcaml_utils__Lru
-                                                                           ^^^^^^^^^^^^^^^^^
- Warning 49 [no-cmi-file]: no cmi file was found in path for module Oxcaml_utils__Lru
- 
- File "src/ocaml_optcomp/ocaml_optcomp.ml", line 474, characters 68-84:
- 474 | module Relocation_table                                           = Relocation_table
-                                                                           ^^^^^^^^^^^^^^^^
- Warning 49 [no-cmi-file]: no cmi file was found in path for module Relocation_table
- 
- File "src/ocaml_optcomp/ocaml_optcomp.ml", line 487, characters 68-80:
- 487 | module Symbol_entry                                               = Symbol_entry
-                                                                           ^^^^^^^^^^^^
- Warning 49 [no-cmi-file]: no cmi file was found in path for module Symbol_entry
- (cd _build/default && /home/opam/.opam/5.2.0+flambda2/bin/ocamlopt.opt -w -40 -safe-string -g -I src/ocaml_optcomp/.ocaml_optcomp.objs/byte -I src/ocaml_optcomp/.ocaml_optcomp.objs/native -I /home/opam/.opam/5.2.0+flambda2/lib/ocaml/compiler-libs -intf-suffix .ml -no-alias-deps -o src/ocaml_optcomp/.ocaml_optcomp.objs/native/ocaml_optcomp.cmx -c -impl src/ocaml_optcomp/ocaml_optcomp.ml)
- File "src/ocaml_optcomp/ocaml_optcomp.ml", line 438, characters 68-95:
- 438 | module Oxcaml_utils__File_sections                                = Oxcaml_utils__File_sections
-                                                                           ^^^^^^^^^^^^^^^^^^^^^^^^^^^
- Warning 49 [no-cmi-file]: no cmi file was found in path for module Oxcaml_utils__File_sections
- 
- File "src/ocaml_optcomp/ocaml_optcomp.ml", line 439, characters 68-85:
- 439 | module Oxcaml_utils__Lru                                          = Oxcaml_utils__Lru
-                                                                           ^^^^^^^^^^^^^^^^^
- Warning 49 [no-cmi-file]: no cmi file was found in path for module Oxcaml_utils__Lru
- 
- File "src/ocaml_optcomp/ocaml_optcomp.ml", line 474, characters 68-84:
- 474 | module Relocation_table                                           = Relocation_table
-                                                                           ^^^^^^^^^^^^^^^^
- Warning 49 [no-cmi-file]: no cmi file was found in path for module Relocation_table
- 
- File "src/ocaml_optcomp/ocaml_optcomp.ml", line 487, characters 68-80:
- 487 | module Symbol_entry                                               = Symbol_entry
-                                                                           ^^^^^^^^^^^^
- Warning 49 [no-cmi-file]: no cmi file was found in path for module Symbol_entry
-> compiled  ocaml-compiler-libs.v0.17.0+ox
Processing 64/108: [dune-configurator: dune build] [integers: dune build] [sexplib0: dune build]
-> installed ocaml-compiler-libs.v0.17.0+ox
Processing 65/108: [dune-configurator: dune build] [integers: dune build] [sexplib0: dune build]
+ /home/opam/.opam/opam-init/hooks/sandbox.sh "build" "dune" "build" "-p" "integers" "-j" "71" (CWD=/home/opam/.opam/5.2.0+flambda2/.opam-switch/build/integers.0.7.0)
-> compiled  integers.0.7.0
Processing 65/108: [dune-configurator: dune build] [sexplib0: dune build]
-> installed integers.0.7.0
Processing 66/108: [dune-configurator: dune build] [sexplib0: dune build]
+ /home/opam/.opam/opam-init/hooks/sandbox.sh "build" "dune" "build" "-p" "sexplib0" "-j" "71" (CWD=/home/opam/.opam/5.2.0+flambda2/.opam-switch/build/sexplib0.v0.18~preview.130.36+326)
-> compiled  sexplib0.v0.18~preview.130.36+326
Processing 66/108: [dune-configurator: dune build]
-> installed sexplib0.v0.18~preview.130.36+326
Processing 67/108: [dune-configurator: dune build]
Processing 68/108: [dune-configurator: dune build] [parsexp: dune build]
[ppxlib_ast: patch] applying ppxlib+ast+ast.ml.patch
[ppxlib_ast: patch] applying ppxlib+ast+ast_helper_lite.ml.patch
[ppxlib_ast: patch] applying ppxlib+ast+ast_helper_lite.mli.patch
[ppxlib_ast: patch] applying ppxlib+ast+location_error.ml.patch
[ppxlib_ast: patch] applying ppxlib+ast+location_error.mli.patch
[ppxlib_ast: patch] applying ppxlib+ast+supported_version+supported_version.ml.patch
[ppxlib_ast: patch] applying ppxlib+ast+versions.ml.patch
[ppxlib_ast: patch] applying ppxlib+ast+versions.mli.patch
[ppxlib_ast: patch] applying ppxlib+astlib+ast_414.ml.patch
[ppxlib_ast: patch] applying ppxlib+astlib+ast_500.ml.patch
[ppxlib_ast: patch] applying ppxlib+astlib+ast_999.ml.patch
[ppxlib_ast: patch] applying ppxlib+astlib+ast_metadata.mli.patch
[ppxlib_ast: patch] applying ppxlib+astlib+astlib.ml.patch
[ppxlib_ast: patch] applying ppxlib+astlib+cinaps+astlib_cinaps_helpers.ml.patch
[ppxlib_ast: patch] applying ppxlib+astlib+config+gen.ml.patch
[ppxlib_ast: patch] applying ppxlib+astlib+migrate_500_999.ml.patch
[ppxlib_ast: patch] applying ppxlib+astlib+migrate_999_500.ml.patch
[ppxlib_ast: patch] applying ppxlib+astlib+parse.mli.patch
[ppxlib_ast: patch] applying ppxlib+astlib+pprintast.ml.patch
[ppxlib_ast: patch] applying ppxlib+astlib+pprintast.mli.patch
[ppxlib_ast: patch] applying ppxlib+astlib+stdlib0.ml.patch
[ppxlib_ast: patch] applying ppxlib+stdppx+stdppx.ml.patch
[ppxlib_ast: patch] applying dune.patch
Processing 69/108: [dune-configurator: dune build] [parsexp: dune build] [ppxlib_ast: bash]
+ /home/opam/.opam/opam-init/hooks/sandbox.sh "build" "bash" "./cleanup.sh" (CWD=/home/opam/.opam/5.2.0+flambda2/.opam-switch/build/ppxlib_ast.0.33.0+ox)
Processing 69/108: [dune-configurator: dune build] [parsexp: dune build] [ppxlib_ast: dune build]
+ /home/opam/.opam/opam-init/hooks/sandbox.sh "build" "dune" "build" "-p" "dune-configurator" "-j" "71" "@install" (CWD=/home/opam/.opam/5.2.0+flambda2/.opam-switch/build/dune-configurator.3.19.1)
-> compiled  dune-configurator.3.19.1
Processing 69/108: [parsexp: dune build] [ppxlib_ast: dune build]
-> installed dune-configurator.3.19.1
Processing 70/108: [parsexp: dune build] [ppxlib_ast: dune build]
Processing 71/108: [ctypes: dune build] [parsexp: dune build] [ppxlib_ast: dune build]
+ /home/opam/.opam/opam-init/hooks/sandbox.sh "build" "dune" "build" "-p" "parsexp" "-j" "71" (CWD=/home/opam/.opam/5.2.0+flambda2/.opam-switch/build/parsexp.v0.18~preview.130.36+326)
-> compiled  parsexp.v0.18~preview.130.36+326
Processing 71/108: [ctypes: dune build] [ppxlib_ast: dune build]
-> installed parsexp.v0.18~preview.130.36+326
Processing 72/108: [ctypes: dune build] [ppxlib_ast: dune build]
Processing 73/108: [ctypes: dune build] [ppxlib_ast: dune build] [sexplib: dune build]
+ /home/opam/.opam/opam-init/hooks/sandbox.sh "build" "dune" "build" "-p" "sexplib" "-j" "71" (CWD=/home/opam/.opam/5.2.0+flambda2/.opam-switch/build/sexplib.v0.18~preview.130.36+326)
-> compiled  sexplib.v0.18~preview.130.36+326
Processing 73/108: [ctypes: dune build] [ppxlib_ast: dune build]
-> installed sexplib.v0.18~preview.130.36+326
Processing 74/108: [ctypes: dune build] [ppxlib_ast: dune build]
+ /home/opam/.opam/opam-init/hooks/sandbox.sh "build" "dune" "build" "-p" "ctypes" "-j" "71" "--promote-install-files=false" "@install" (CWD=/home/opam/.opam/5.2.0+flambda2/.opam-switch/build/ctypes.0.23.0)
- (cd _build/default && /home/opam/.opam/5.2.0+flambda2/bin/ocamlc.opt -w -40 -g -bin-annot -bin-annot-occurrences -I src/ctypes/.ctypes.objs/byte -I /home/opam/.opam/5.2.0+flambda2/lib/bigarray-compat -I /home/opam/.opam/5.2.0+flambda2/lib/integers -I /home/opam/.opam/5.2.0+flambda2/lib/stdlib-shims -intf-suffix .ml -no-alias-deps -o src/ctypes/.ctypes.objs/byte/ctypes_coerce.cmo -c -impl src/ctypes/ctypes_coerce.ml)
- File "src/ctypes/ctypes_coerce.ml", line 31, characters 9-34:
- 31 | let () = Printexc.register_printer show_uncoercible
-               ^^^^^^^^^^^^^^^^^^^^^^^^^
- Alert unsafe_multidomain: Stdlib.Printexc.register_printer
- Use [Printexc.Safe.register_printer].
- (cd _build/default && /home/opam/.opam/5.2.0+flambda2/bin/ocamlopt.opt -w -40 -g -I src/ctypes/.ctypes.objs/byte -I src/ctypes/.ctypes.objs/native -I /home/opam/.opam/5.2.0+flambda2/lib/bigarray-compat -I /home/opam/.opam/5.2.0+flambda2/lib/integers -I /home/opam/.opam/5.2.0+flambda2/lib/stdlib-shims -intf-suffix .ml -no-alias-deps -o src/ctypes/.ctypes.objs/native/ctypes_coerce.cmx -c -impl src/ctypes/ctypes_coerce.ml)
- File "src/ctypes/ctypes_coerce.ml", line 31, characters 9-34:
- 31 | let () = Printexc.register_printer show_uncoercible
-               ^^^^^^^^^^^^^^^^^^^^^^^^^
- Alert unsafe_multidomain: Stdlib.Printexc.register_printer
- Use [Printexc.Safe.register_printer].
- (cd _build/default && /home/opam/.opam/5.2.0+flambda2/bin/ocamlopt.opt -w -40 -g -I src/ctypes-top/.ctypes_top.objs/byte -I src/ctypes-top/.ctypes_top.objs/native -I /home/opam/.opam/5.2.0+flambda2/lib/bigarray-compat -I /home/opam/.opam/5.2.0+flambda2/lib/integers -I /home/opam/.opam/5.2.0+flambda2/lib/ocaml/compiler-libs -I /home/opam/.opam/5.2.0+flambda2/lib/stdlib-shims -I src/ctypes/.ctypes.objs/byte -I src/ctypes/.ctypes.objs/native -intf-suffix .ml -no-alias-deps -open Ctypes_top -o src/ctypes-top/.ctypes_top.objs/native/ctypes_top__Install_ctypes_printers.cmx -c -impl src/ctypes-top/install_ctypes_printers.ml)
- File "_none_", line 1:
- Warning 58 [no-cmx-file]: no cmx file was found in path for module Toploop, and its interface was not compiled with -opaque
Processing 74/108: [ctypes: dune install] [ppxlib_ast: dune build]
+ /home/opam/.opam/opam-init/hooks/sandbox.sh "build" "dune" "install" "-p" "ctypes" "--create-install-files" "ctypes" (CWD=/home/opam/.opam/5.2.0+flambda2/.opam-switch/build/ctypes.0.23.0)
-> compiled  ctypes.0.23.0
Processing 74/108: [ppxlib_ast: dune build]
-> installed ctypes.0.23.0
Processing 75/108: [ppxlib_ast: dune build]
Processing 76/108: [ctypes-foreign: dune build] [ppxlib_ast: dune build]
+ /home/opam/.opam/opam-init/hooks/sandbox.sh "build" "dune" "build" "-p" "ctypes-foreign" "-j" "71" "--promote-install-files=false" "@install" (CWD=/home/opam/.opam/5.2.0+flambda2/.opam-switch/build/ctypes-foreign.0.23.0)
- (cd _build/default && /home/opam/.opam/5.2.0+flambda2/bin/ocamlc.opt -w -40 -g -bin-annot -bin-annot-occurrences -I src/ctypes-foreign/.ctypes_foreign.objs/byte -I src/ctypes-foreign/.ctypes_foreign.objs/public_cmi -I /home/opam/.opam/5.2.0+flambda2/lib/bigarray-compat -I /home/opam/.opam/5.2.0+flambda2/lib/ctypes -I /home/opam/.opam/5.2.0+flambda2/lib/integers -I /home/opam/.opam/5.2.0+flambda2/lib/ocaml/threads -I /home/opam/.opam/5.2.0+flambda2/lib/ocaml/unix -I /home/opam/.opam/5.2.0+flambda2/lib/stdlib-shims -no-alias-deps -o src/ctypes-foreign/.ctypes_foreign.objs/byte/ctypes_ffi_stubs.cmo -c -impl src/ctypes-foreign/ctypes_ffi_stubs.ml)
- File "src/ctypes-foreign/ctypes_ffi_stubs.ml", line 86, characters 9-36:
- 86 | let () = Callback.register_exception "FFI_internal_error"
-               ^^^^^^^^^^^^^^^^^^^^^^^^^^^
- Alert unsafe_multidomain: Stdlib.Callback.register_exception
- Use [Callback.Safe.register_exception].
- 
- File "src/ctypes-foreign/ctypes_ffi_stubs.ml", line 92, characters 9-36:
- 92 | let () = Callback.register_exception "CallToExpiredClosure"
-               ^^^^^^^^^^^^^^^^^^^^^^^^^^^
- Alert unsafe_multidomain: Stdlib.Callback.register_exception
- Use [Callback.Safe.register_exception].
- (cd _build/default && /home/opam/.opam/5.2.0+flambda2/bin/ocamlopt.opt -w -40 -g -I src/ctypes-foreign/.ctypes_foreign.objs/byte -I src/ctypes-foreign/.ctypes_foreign.objs/native -I src/ctypes-foreign/.ctypes_foreign.objs/public_cmi -I /home/opam/.opam/5.2.0+flambda2/lib/bigarray-compat -I /home/opam/.opam/5.2.0+flambda2/lib/ctypes -I /home/opam/.opam/5.2.0+flambda2/lib/integers -I /home/opam/.opam/5.2.0+flambda2/lib/ocaml/threads -I /home/opam/.opam/5.2.0+flambda2/lib/ocaml/unix -I /home/opam/.opam/5.2.0+flambda2/lib/stdlib-shims -intf-suffix .ml -no-alias-deps -o src/ctypes-foreign/.ctypes_foreign.objs/native/ctypes_ffi_stubs.cmx -c -impl src/ctypes-foreign/ctypes_ffi_stubs.ml)
- File "src/ctypes-foreign/ctypes_ffi_stubs.ml", line 86, characters 9-36:
- 86 | let () = Callback.register_exception "FFI_internal_error"
-               ^^^^^^^^^^^^^^^^^^^^^^^^^^^
- Alert unsafe_multidomain: Stdlib.Callback.register_exception
- Use [Callback.Safe.register_exception].
- 
- File "src/ctypes-foreign/ctypes_ffi_stubs.ml", line 92, characters 9-36:
- 92 | let () = Callback.register_exception "CallToExpiredClosure"
-               ^^^^^^^^^^^^^^^^^^^^^^^^^^^
- Alert unsafe_multidomain: Stdlib.Callback.register_exception
- Use [Callback.Safe.register_exception].
Processing 76/108: [ctypes-foreign: dune install] [ppxlib_ast: dune build]
+ /home/opam/.opam/opam-init/hooks/sandbox.sh "build" "dune" "install" "-p" "ctypes-foreign" "--create-install-files" "ctypes-foreign" (CWD=/home/opam/.opam/5.2.0+flambda2/.opam-switch/build/ctypes-foreign.0.23.0)
-> compiled  ctypes-foreign.0.23.0
Processing 76/108: [ppxlib_ast: dune build]
-> installed ctypes-foreign.0.23.0
Processing 77/108: [ppxlib_ast: dune build]
+ /home/opam/.opam/opam-init/hooks/sandbox.sh "build" "dune" "build" "-p" "ppxlib_ast" "-j" "71" "@install" (CWD=/home/opam/.opam/5.2.0+flambda2/.opam-switch/build/ppxlib_ast.0.33.0+ox)
-> compiled  ppxlib_ast.0.33.0+ox
-> installed ppxlib_ast.0.33.0+ox
Processing 79/108: [ppxlib_jane: dune build]
+ /home/opam/.opam/opam-init/hooks/sandbox.sh "build" "dune" "build" "-p" "ppxlib_jane" "-j" "71" (CWD=/home/opam/.opam/5.2.0+flambda2/.opam-switch/build/ppxlib_jane.v0.18~preview.130.36+326)
-> compiled  ppxlib_jane.v0.18~preview.130.36+326
-> installed ppxlib_jane.v0.18~preview.130.36+326
[ppxlib: patch] applying ppxlib+doc+writing_ppxs.mld.patch
[ppxlib: patch] applying ppxlib+metaquot+ppxlib_metaquot.ml.patch
[ppxlib: patch] applying ppxlib+runner_as_ppx+ppxlib_runner_as_ppx.ml.patch
[ppxlib: patch] applying ppxlib+src+ast_builder.ml.patch
[ppxlib: patch] applying ppxlib+src+ast_builder.mli.patch
[ppxlib: patch] applying ppxlib+src+ast_builder_intf.ml.patch
[ppxlib: patch] applying ppxlib+src+ast_pattern.ml.patch
[ppxlib: patch] applying ppxlib+src+ast_pattern.mli.patch
[ppxlib: patch] applying ppxlib+src+ast_traverse.ml.patch
[ppxlib: patch] applying ppxlib+src+attribute.ml.patch
[ppxlib: patch] applying ppxlib+src+attribute.mli.patch
[ppxlib: patch] applying ppxlib+src+cinaps+ppxlib_cinaps_helpers.ml.patch
[ppxlib: patch] applying ppxlib+src+code_matcher.ml.patch
[ppxlib: patch] applying ppxlib+src+code_matcher.mli.patch
[ppxlib: patch] applying ppxlib+src+common.ml.patch
[ppxlib: patch] applying ppxlib+src+common.mli.patch
[ppxlib: patch] applying ppxlib+src+context_free.ml.patch
[ppxlib: patch] applying ppxlib+src+context_free.mli.patch
[ppxlib: patch] applying ppxlib+src+deriving.ml.patch
[ppxlib: patch] applying ppxlib+src+deriving.mli.patch
[ppxlib: patch] applying ppxlib+src+driver.ml.patch
[ppxlib: patch] applying ppxlib+src+driver.mli.patch
[ppxlib: patch] applying ppxlib+src+gen+gen_ast_builder.ml.patch
[ppxlib: patch] applying ppxlib+src+gen+gen_ast_pattern.ml.patch
[ppxlib: patch] applying ppxlib+src+gen+import.ml.patch
[ppxlib: patch] applying ppxlib+src+ignore_unused_warning.ml.patch
[ppxlib: patch] applying ppxlib+src+location.ml.patch
[ppxlib: patch] applying ppxlib+src+location.mli.patch
[ppxlib: patch] applying ppxlib+src+name.ml.patch
[ppxlib: patch] applying ppxlib+src+utils.mli.patch
[ppxlib: patch] applying ppxlib+traverse+ppxlib_traverse.ml.patch
[ppxlib: patch] applying dune.patch
[ppxlib: patch] applying location_check.ml.patch
[ppxlib: patch] applying utils.ml.patch
Processing 81/108: [ppxlib: rm ast]
+ /home/opam/.opam/opam-init/hooks/sandbox.sh "build" "rm" "-rf" "ast" "astlib" "stdppx" "traverse_builtins" (CWD=/home/opam/.opam/5.2.0+flambda2/.opam-switch/build/ppxlib.0.33.0+ox)
Processing 81/108: [ppxlib: dune build]
+ /home/opam/.opam/opam-init/hooks/sandbox.sh "build" "dune" "build" "-p" "ppxlib" "-j" "71" "@install" (CWD=/home/opam/.opam/5.2.0+flambda2/.opam-switch/build/ppxlib.0.33.0+ox)
- (cd _build/default && /home/opam/.opam/5.2.0+flambda2/bin/ocamlopt.opt -w -40 -safe-string -g -I src/gen/.gen_ast_pattern.eobjs/byte -I src/gen/.gen_ast_pattern.eobjs/native -I /home/opam/.opam/5.2.0+flambda2/lib/ppxlib_ast/ast -I /home/opam/.opam/5.2.0+flambda2/lib/ppxlib_ast/astlib -I /home/opam/.opam/5.2.0+flambda2/lib/ppxlib_ast/stdppx -I /home/opam/.opam/5.2.0+flambda2/lib/ppxlib_ast/traverse_builtins -I /home/opam/.opam/5.2.0+flambda2/lib/ppxlib_jane -I /home/opam/.opam/5.2.0+flambda2/lib/stdlib-shims -I shims/ast/.ppxlib_ast.objs/byte -I shims/ast/.ppxlib_ast.objs/native -I shims/astlib/.astlib.objs/byte -I shims/astlib/.astlib.objs/native -I shims/stdppx/.stdppx.objs/byte -I shims/stdppx/.stdppx.objs/native -I shims/traverse_builtins/.ppxlib_traverse_builtins.objs/byte -I shims/traverse_builtins/.ppxlib_traverse_builtins.objs/native -intf-suffix .ml -no-alias-deps -open Dune__exe -o src/gen/.gen_ast_pattern.eobjs/native/dune__exe__Import.cmx -c -impl src/gen/import.ml)
- File "_none_", line 1:
- Warning 58 [no-cmx-file]: no cmx file was found in path for module Location, and its interface was not compiled with -opaque
- 
- File "_none_", line 1:
- Warning 58 [no-cmx-file]: no cmx file was found in path for module Longident, and its interface was not compiled with -opaque
- (cd _build/default && /home/opam/.opam/5.2.0+flambda2/bin/ocamlopt.opt -w -40 -safe-string -g -I src/gen/.gen_ast_pattern.eobjs/byte -I src/gen/.gen_ast_pattern.eobjs/native -I /home/opam/.opam/5.2.0+flambda2/lib/ppxlib_ast/ast -I /home/opam/.opam/5.2.0+flambda2/lib/ppxlib_ast/astlib -I /home/opam/.opam/5.2.0+flambda2/lib/ppxlib_ast/stdppx -I /home/opam/.opam/5.2.0+flambda2/lib/ppxlib_ast/traverse_builtins -I /home/opam/.opam/5.2.0+flambda2/lib/ppxlib_jane -I /home/opam/.opam/5.2.0+flambda2/lib/stdlib-shims -I shims/ast/.ppxlib_ast.objs/byte -I shims/ast/.ppxlib_ast.objs/native -I shims/astlib/.astlib.objs/byte -I shims/astlib/.astlib.objs/native -I shims/stdppx/.stdppx.objs/byte -I shims/stdppx/.stdppx.objs/native -I shims/traverse_builtins/.ppxlib_traverse_builtins.objs/byte -I shims/traverse_builtins/.ppxlib_traverse_builtins.objs/native -intf-suffix .ml -no-alias-deps -open Dune__exe -o src/gen/.gen_ast_pattern.eobjs/native/dune__exe__Gen_ast_pattern.cmx -c -impl src/gen/gen_ast_pattern.ml)
- File "_none_", line 1:
- Warning 58 [no-cmx-file]: no cmx file was found in path for module Location, and its interface was not compiled with -opaque
- (cd _build/default && /home/opam/.opam/5.2.0+flambda2/bin/ocamlopt.opt -w -40 -safe-string -g -I src/gen/.gen_ast_pattern.eobjs/byte -I src/gen/.gen_ast_pattern.eobjs/native -I /home/opam/.opam/5.2.0+flambda2/lib/ppxlib_ast/ast -I /home/opam/.opam/5.2.0+flambda2/lib/ppxlib_ast/astlib -I /home/opam/.opam/5.2.0+flambda2/lib/ppxlib_ast/stdppx -I /home/opam/.opam/5.2.0+flambda2/lib/ppxlib_ast/traverse_builtins -I /home/opam/.opam/5.2.0+flambda2/lib/ppxlib_jane -I /home/opam/.opam/5.2.0+flambda2/lib/stdlib-shims -I shims/ast/.ppxlib_ast.objs/byte -I shims/ast/.ppxlib_ast.objs/native -I shims/astlib/.astlib.objs/byte -I shims/astlib/.astlib.objs/native -I shims/stdppx/.stdppx.objs/byte -I shims/stdppx/.stdppx.objs/native -I shims/traverse_builtins/.ppxlib_traverse_builtins.objs/byte -I shims/traverse_builtins/.ppxlib_traverse_builtins.objs/native -intf-suffix .ml -no-alias-deps -open Dune__exe -o src/gen/.gen_ast_pattern.eobjs/native/dune__exe__Gen_ast_builder.cmx -c -impl src/gen/gen_ast_builder.ml)
- File "_none_", line 1:
- Warning 58 [no-cmx-file]: no cmx file was found in path for module Location, and its interface was not compiled with -opaque
- (cd _build/default && /home/opam/.opam/5.2.0+flambda2/bin/ocamlc.opt -w -40 -safe-string -open Ocaml_shadow -g -bin-annot -bin-annot-occurrences -I src/.ppxlib.objs/byte -I /home/opam/.opam/5.2.0+flambda2/lib/ocaml-compiler-libs/common -I /home/opam/.opam/5.2.0+flambda2/lib/ocaml-compiler-libs/shadow -I /home/opam/.opam/5.2.0+flambda2/lib/ocaml/compiler-libs -I /home/opam/.opam/5.2.0+flambda2/lib/ppx_derivers -I /home/opam/.opam/5.2.0+flambda2/lib/ppxlib_ast/ast -I /home/opam/.opam/5.2.0+flambda2/lib/ppxlib_ast/astlib -I /home/opam/.opam/5.2.0+flambda2/lib/ppxlib_ast/stdppx -I /home/opam/.opam/5.2.0+flambda2/lib/ppxlib_ast/traverse_builtins -I /home/opam/.opam/5.2.0+flambda2/lib/ppxlib_jane -I /home/opam/.opam/5.2.0+flambda2/lib/sexplib0 -I /home/opam/.opam/5.2.0+flambda2/lib/stdlib-shims -I print-diff/.ppxlib_print_diff.objs/byte -I shims/ast/.ppxlib_ast.objs/byte -I shims/astlib/.astlib.objs/byte -I shims/stdppx/.stdppx.objs/byte -I shims/traverse_builtins/.ppxlib_traverse_builtins.objs/byte -no-alias-deps -open Ppxlib__ -o src/.ppxlib.objs/byte/ppxlib__Ast_pattern_generated.cmo -c -impl src/ast_pattern_generated.ml)
- File "src/ast_pattern_generated.ml", line 1584, characters 9-10:
- 1584 |        | _ -> fail loc "Modality")
-                 ^
- Warning 11 [redundant-case]: this match case is unused.
- 
- File "src/ast_pattern_generated.ml", line 1591, characters 9-10:
- 1591 |        | _ -> fail loc "Mode")
-                 ^
- Warning 11 [redundant-case]: this match case is unused.
- (cd _build/default && /home/opam/.opam/5.2.0+flambda2/bin/ocamlopt.opt -w -40 -safe-string -open Ocaml_shadow -g -I src/.ppxlib.objs/byte -I src/.ppxlib.objs/native -I /home/opam/.opam/5.2.0+flambda2/lib/ocaml-compiler-libs/common -I /home/opam/.opam/5.2.0+flambda2/lib/ocaml-compiler-libs/shadow -I /home/opam/.opam/5.2.0+flambda2/lib/ocaml/compiler-libs -I /home/opam/.opam/5.2.0+flambda2/lib/ppx_derivers -I /home/opam/.opam/5.2.0+flambda2/lib/ppxlib_ast/ast -I /home/opam/.opam/5.2.0+flambda2/lib/ppxlib_ast/astlib -I /home/opam/.opam/5.2.0+flambda2/lib/ppxlib_ast/stdppx -I /home/opam/.opam/5.2.0+flambda2/lib/ppxlib_ast/traverse_builtins -I /home/opam/.opam/5.2.0+flambda2/lib/ppxlib_jane -I /home/opam/.opam/5.2.0+flambda2/lib/sexplib0 -I /home/opam/.opam/5.2.0+flambda2/lib/stdlib-shims -I print-diff/.ppxlib_print_diff.objs/byte -I print-diff/.ppxlib_print_diff.objs/native -I shims/ast/.ppxlib_ast.objs/byte -I shims/ast/.ppxlib_ast.objs/native -I shims/astlib/.astlib.objs/byte -I shims/astlib/.astlib.objs/native -I shims/stdppx/.stdppx.objs/byte -I shims/stdppx/.stdppx.objs/native -I shims/traverse_builtins/.ppxlib_traverse_builtins.objs/byte -I shims/traverse_builtins/.ppxlib_traverse_builtins.objs/native -intf-suffix .ml -no-alias-deps -open Ppxlib__ -o src/.ppxlib.objs/native/ppxlib__Ast_pattern_generated.cmx -c -impl src/ast_pattern_generated.ml)
- File "src/ast_pattern_generated.ml", line 1584, characters 9-10:
- 1584 |        | _ -> fail loc "Modality")
-                 ^
- Warning 11 [redundant-case]: this match case is unused.
- 
- File "src/ast_pattern_generated.ml", line 1591, characters 9-10:
- 1591 |        | _ -> fail loc "Mode")
-                 ^
- Warning 11 [redundant-case]: this match case is unused.
- (cd _build/default && /home/opam/.opam/5.2.0+flambda2/bin/ocamlopt.opt -w -40 -safe-string -g -I metaquot/.ppxlib_metaquot.objs/byte -I metaquot/.ppxlib_metaquot.objs/native -I /home/opam/.opam/5.2.0+flambda2/lib/ppxlib_ast/ast -I /home/opam/.opam/5.2.0+flambda2/lib/ppxlib_ast/astlib -I /home/opam/.opam/5.2.0+flambda2/lib/ppxlib_ast/traverse_builtins -I metaquot_lifters/.ppxlib_metaquot_lifters.objs/byte -I metaquot_lifters/.ppxlib_metaquot_lifters.objs/native -I shims/ast/.ppxlib_ast.objs/byte -I shims/ast/.ppxlib_ast.objs/native -I shims/astlib/.astlib.objs/byte -I shims/astlib/.astlib.objs/native -I shims/traverse_builtins/.ppxlib_traverse_builtins.objs/byte -I shims/traverse_builtins/.ppxlib_traverse_builtins.objs/native -I src/.ppxlib.objs/byte -I src/.ppxlib.objs/native -intf-suffix .ml -no-alias-deps -o metaquot/.ppxlib_metaquot.objs/native/ppxlib_metaquot.cmx -c -impl metaquot/ppxlib_metaquot.ml)
- File "_none_", line 1:
- Warning 58 [no-cmx-file]: no cmx file was found in path for module Ppxlib_jane__Shim, and its interface was not compiled with -opaque
- (cd _build/default && /home/opam/.opam/5.2.0+flambda2/bin/ocamlopt.opt -w -40 -safe-string -g -I traverse/.ppxlib_traverse.objs/byte -I traverse/.ppxlib_traverse.objs/native -I /home/opam/.opam/5.2.0+flambda2/lib/ppxlib_ast/ast -I /home/opam/.opam/5.2.0+flambda2/lib/ppxlib_ast/stdppx -I /home/opam/.opam/5.2.0+flambda2/lib/ppxlib_ast/traverse_builtins -I /home/opam/.opam/5.2.0+flambda2/lib/ppxlib_jane -I /home/opam/.opam/5.2.0+flambda2/lib/stdlib-shims -I shims/ast/.ppxlib_ast.objs/byte -I shims/ast/.ppxlib_ast.objs/native -I shims/stdppx/.stdppx.objs/byte -I shims/stdppx/.stdppx.objs/native -I shims/traverse_builtins/.ppxlib_traverse_builtins.objs/byte -I shims/traverse_builtins/.ppxlib_traverse_builtins.objs/native -I src/.ppxlib.objs/byte -I src/.ppxlib.objs/native -intf-suffix .ml -no-alias-deps -o traverse/.ppxlib_traverse.objs/native/ppxlib_traverse.cmx -c -impl traverse/ppxlib_traverse.pp.ml)
- File "_none_", line 1:
- Warning 58 [no-cmx-file]: no cmx file was found in path for module Astlib__Location, and its interface was not compiled with -opaque
-> compiled  ppxlib.0.33.0+ox
-> installed ppxlib.0.33.0+ox
Processing 83/108: [ppx_cold: dune build]
Processing 84/108: [ppx_cold: dune build] [ppx_compare: dune build]
Processing 85/108: [ppx_cold: dune build] [ppx_compare: dune build] [ppx_enumerate: dune build]
Processing 86/108: [ppx_cold: dune build] [ppx_compare: dune build] [ppx_enumerate: dune build] [ppx_globalize: dune build]
Processing 87/108: [ppx_cold: dune build] [ppx_compare: dune build] [ppx_enumerate: dune build] [ppx_globalize: dune build] [ppx_helpers: dune build]
Processing 88/108: [ppx_cold: dune build] [ppx_compare: dune build] [ppx_enumerate: dune build] [ppx_globalize: dune build] [ppx_helpers: dune build] [ppx_shorthand: dune build]
Processing 89/108: [ppx_cold: dune build] [ppx_compare: dune build] [ppx_enumerate: dune build] [ppx_globalize: dune build] [ppx_helpers: dune build] [ppx_shorthand: dune build] [ppx_template: dune build]
+ /home/opam/.opam/opam-init/hooks/sandbox.sh "build" "dune" "build" "-p" "ppx_helpers" "-j" "71" (CWD=/home/opam/.opam/5.2.0+flambda2/.opam-switch/build/ppx_helpers.v0.18~preview.130.36+326)
-> compiled  ppx_helpers.v0.18~preview.130.36+326
Processing 89/108: [ppx_cold: dune build] [ppx_compare: dune build] [ppx_enumerate: dune build] [ppx_globalize: dune build] [ppx_shorthand: dune build] [ppx_template: dune build]
-> installed ppx_helpers.v0.18~preview.130.36+326
Processing 90/108: [ppx_cold: dune build] [ppx_compare: dune build] [ppx_enumerate: dune build] [ppx_globalize: dune build] [ppx_shorthand: dune build] [ppx_template: dune build]
Processing 91/108: [ppx_cold: dune build] [ppx_compare: dune build] [ppx_enumerate: dune build] [ppx_globalize: dune build] [ppx_sexp_conv: dune build] [ppx_shorthand: dune build] [ppx_template: dune build]
+ /home/opam/.opam/opam-init/hooks/sandbox.sh "build" "dune" "build" "-p" "ppx_cold" "-j" "71" (CWD=/home/opam/.opam/5.2.0+flambda2/.opam-switch/build/ppx_cold.v0.18~preview.130.36+326)
-> compiled  ppx_cold.v0.18~preview.130.36+326
Processing 91/108: [ppx_compare: dune build] [ppx_enumerate: dune build] [ppx_globalize: dune build] [ppx_sexp_conv: dune build] [ppx_shorthand: dune build] [ppx_template: dune build]
-> installed ppx_cold.v0.18~preview.130.36+326
Processing 92/108: [ppx_compare: dune build] [ppx_enumerate: dune build] [ppx_globalize: dune build] [ppx_sexp_conv: dune build] [ppx_shorthand: dune build] [ppx_template: dune build]
+ /home/opam/.opam/opam-init/hooks/sandbox.sh "build" "dune" "build" "-p" "ppx_globalize" "-j" "71" (CWD=/home/opam/.opam/5.2.0+flambda2/.opam-switch/build/ppx_globalize.v0.18~preview.130.36+326)
-> compiled  ppx_globalize.v0.18~preview.130.36+326
Processing 92/108: [ppx_compare: dune build] [ppx_enumerate: dune build] [ppx_sexp_conv: dune build] [ppx_shorthand: dune build] [ppx_template: dune build]
-> installed ppx_globalize.v0.18~preview.130.36+326
Processing 93/108: [ppx_compare: dune build] [ppx_enumerate: dune build] [ppx_sexp_conv: dune build] [ppx_shorthand: dune build] [ppx_template: dune build]
+ /home/opam/.opam/opam-init/hooks/sandbox.sh "build" "dune" "build" "-p" "ppx_enumerate" "-j" "71" (CWD=/home/opam/.opam/5.2.0+flambda2/.opam-switch/build/ppx_enumerate.v0.18~preview.130.36+326)
-> compiled  ppx_enumerate.v0.18~preview.130.36+326
Processing 93/108: [ppx_compare: dune build] [ppx_sexp_conv: dune build] [ppx_shorthand: dune build] [ppx_template: dune build]
-> installed ppx_enumerate.v0.18~preview.130.36+326
Processing 94/108: [ppx_compare: dune build] [ppx_sexp_conv: dune build] [ppx_shorthand: dune build] [ppx_template: dune build]
+ /home/opam/.opam/opam-init/hooks/sandbox.sh "build" "dune" "build" "-p" "ppx_compare" "-j" "71" (CWD=/home/opam/.opam/5.2.0+flambda2/.opam-switch/build/ppx_compare.v0.18~preview.130.36+326)
-> compiled  ppx_compare.v0.18~preview.130.36+326
Processing 94/108: [ppx_sexp_conv: dune build] [ppx_shorthand: dune build] [ppx_template: dune build]
-> installed ppx_compare.v0.18~preview.130.36+326
Processing 95/108: [ppx_sexp_conv: dune build] [ppx_shorthand: dune build] [ppx_template: dune build]
+ /home/opam/.opam/opam-init/hooks/sandbox.sh "build" "dune" "build" "-p" "ppx_shorthand" "-j" "71" (CWD=/home/opam/.opam/5.2.0+flambda2/.opam-switch/build/ppx_shorthand.v0.18~preview.130.36+326)
-> compiled  ppx_shorthand.v0.18~preview.130.36+326
Processing 95/108: [ppx_sexp_conv: dune build] [ppx_template: dune build]
-> installed ppx_shorthand.v0.18~preview.130.36+326
Processing 96/108: [ppx_sexp_conv: dune build] [ppx_template: dune build]
+ /home/opam/.opam/opam-init/hooks/sandbox.sh "build" "dune" "build" "-p" "ppx_sexp_conv" "-j" "71" (CWD=/home/opam/.opam/5.2.0+flambda2/.opam-switch/build/ppx_sexp_conv.v0.18~preview.130.36+326)
-> compiled  ppx_sexp_conv.v0.18~preview.130.36+326
Processing 96/108: [ppx_template: dune build]
-> installed ppx_sexp_conv.v0.18~preview.130.36+326
Processing 97/108: [ppx_template: dune build]
Processing 98/108: [ppx_hash: dune build] [ppx_template: dune build]
+ /home/opam/.opam/opam-init/hooks/sandbox.sh "build" "dune" "build" "-p" "ppx_template" "-j" "71" (CWD=/home/opam/.opam/5.2.0+flambda2/.opam-switch/build/ppx_template.v0.18~preview.130.36+326)
-> compiled  ppx_template.v0.18~preview.130.36+326
Processing 98/108: [ppx_hash: dune build]
-> installed ppx_template.v0.18~preview.130.36+326
Processing 99/108: [ppx_hash: dune build]
+ /home/opam/.opam/opam-init/hooks/sandbox.sh "build" "dune" "build" "-p" "ppx_hash" "-j" "71" (CWD=/home/opam/.opam/5.2.0+flambda2/.opam-switch/build/ppx_hash.v0.18~preview.130.36+326)
-> compiled  ppx_hash.v0.18~preview.130.36+326
-> installed ppx_hash.v0.18~preview.130.36+326
Processing 101/108: [ppx_base: dune build]
+ /home/opam/.opam/opam-init/hooks/sandbox.sh "build" "dune" "build" "-p" "ppx_base" "-j" "71" (CWD=/home/opam/.opam/5.2.0+flambda2/.opam-switch/build/ppx_base.v0.18~preview.130.36+326)
-> compiled  ppx_base.v0.18~preview.130.36+326
-> installed ppx_base.v0.18~preview.130.36+326
Processing 103/108: [base: dune build]
+ /home/opam/.opam/opam-init/hooks/sandbox.sh "build" "dune" "build" "-p" "base" "-j" "71" (CWD=/home/opam/.opam/5.2.0+flambda2/.opam-switch/build/base.v0.18~preview.130.36+326)
- (cd _build/default && /home/opam/.opam/5.2.0+flambda2/bin/ocamlc.opt -w -40 -g -bin-annot -bin-annot-occurrences -I src/.base.objs/byte -I /home/opam/.opam/5.2.0+flambda2/lib/basement -I /home/opam/.opam/5.2.0+flambda2/lib/ocaml_intrinsics_kernel -I /home/opam/.opam/5.2.0+flambda2/lib/ppx_compare/runtime-lib -I /home/opam/.opam/5.2.0+flambda2/lib/ppx_enumerate/runtime-lib -I /home/opam/.opam/5.2.0+flambda2/lib/ppx_hash/base_internalhash_types -I /home/opam/.opam/5.2.0+flambda2/lib/ppx_hash/runtime-lib -I /home/opam/.opam/5.2.0+flambda2/lib/ppx_sexp_conv/runtime-lib -I /home/opam/.opam/5.2.0+flambda2/lib/sexplib0 -I shadow-stdlib/src/.shadow_stdlib.objs/byte -intf-suffix .ml -no-alias-deps -open Base__ -o src/.base.objs/byte/base__Modes.cmo -c -impl src/modes.pp.ml)
- File "src/modes.ml", lines 398-402, characters 2-78:
- 398 | ..type local =
- 399 |     [ `global
- 400 |     | `local of (actually_local[@compare.ignore] [@equal.ignore] [@sexp.opaque])
- 401 |     ]
- 402 |   [@@deriving compare ~localize, equal ~localize, hash, sexp_of, sexp_grammar]
- Warning 56 [unreachable-case]: this match case is unreachable.
- Consider replacing it with a refutation case '<pat> -> .'
- 
- File "src/modes.ml", lines 398-402, characters 2-78:
- 398 | ..type local =
- 399 |     [ `global
- 400 |     | `local of (actually_local[@compare.ignore] [@equal.ignore] [@sexp.opaque])
- 401 |     ]
- 402 |   [@@deriving compare ~localize, equal ~localize, hash, sexp_of, sexp_grammar]
- Warning 56 [unreachable-case]: this match case is unreachable.
- Consider replacing it with a refutation case '<pat> -> .'
- 
- File "src/modes.ml", lines 398-402, characters 2-78:
- 398 | ..type local =
- 399 |     [ `global
- 400 |     | `local of (actually_local[@compare.ignore] [@equal.ignore] [@sexp.opaque])
- 401 |     ]
- 402 |   [@@deriving compare ~localize, equal ~localize, hash, sexp_of, sexp_grammar]
- Warning 56 [unreachable-case]: this match case is unreachable.
- Consider replacing it with a refutation case '<pat> -> .'
- 
- File "src/modes.ml", lines 399-401, characters 4-5:
- 399 | ....[ `global
- 400 |     | `local of (actually_local[@compare.ignore] [@equal.ignore] [@sexp.opaque])
- 401 |     ]
- Warning 56 [unreachable-case]: this match case is unreachable.
- Consider replacing it with a refutation case '<pat> -> .'
- (cd _build/default && /home/opam/.opam/5.2.0+flambda2/bin/ocamlopt.opt -w -40 -g -O3 -flambda2-inline-max-depth 10 -I src/.base.objs/byte -I src/.base.objs/native -I /home/opam/.opam/5.2.0+flambda2/lib/basement -I /home/opam/.opam/5.2.0+flambda2/lib/ocaml_intrinsics_kernel -I /home/opam/.opam/5.2.0+flambda2/lib/ppx_compare/runtime-lib -I /home/opam/.opam/5.2.0+flambda2/lib/ppx_enumerate/runtime-lib -I /home/opam/.opam/5.2.0+flambda2/lib/ppx_hash/base_internalhash_types -I /home/opam/.opam/5.2.0+flambda2/lib/ppx_hash/runtime-lib -I /home/opam/.opam/5.2.0+flambda2/lib/ppx_sexp_conv/runtime-lib -I /home/opam/.opam/5.2.0+flambda2/lib/sexplib0 -I shadow-stdlib/src/.shadow_stdlib.objs/byte -I shadow-stdlib/src/.shadow_stdlib.objs/native -intf-suffix .ml -no-alias-deps -open Base__ -o src/.base.objs/native/base__Modes.cmx -c -impl src/modes.pp.ml)
- File "src/modes.ml", lines 398-402, characters 2-78:
- 398 | ..type local =
- 399 |     [ `global
- 400 |     | `local of (actually_local[@compare.ignore] [@equal.ignore] [@sexp.opaque])
- 401 |     ]
- 402 |   [@@deriving compare ~localize, equal ~localize, hash, sexp_of, sexp_grammar]
- Warning 56 [unreachable-case]: this match case is unreachable.
- Consider replacing it with a refutation case '<pat> -> .'
- 
- File "src/modes.ml", lines 398-402, characters 2-78:
- 398 | ..type local =
- 399 |     [ `global
- 400 |     | `local of (actually_local[@compare.ignore] [@equal.ignore] [@sexp.opaque])
- 401 |     ]
- 402 |   [@@deriving compare ~localize, equal ~localize, hash, sexp_of, sexp_grammar]
- Warning 56 [unreachable-case]: this match case is unreachable.
- Consider replacing it with a refutation case '<pat> -> .'
- 
- File "src/modes.ml", lines 398-402, characters 2-78:
- 398 | ..type local =
- 399 |     [ `global
- 400 |     | `local of (actually_local[@compare.ignore] [@equal.ignore] [@sexp.opaque])
- 401 |     ]
- 402 |   [@@deriving compare ~localize, equal ~localize, hash, sexp_of, sexp_grammar]
- Warning 56 [unreachable-case]: this match case is unreachable.
- Consider replacing it with a refutation case '<pat> -> .'
- 
- File "src/modes.ml", lines 399-401, characters 4-5:
- 399 | ....[ `global
- 400 |     | `local of (actually_local[@compare.ignore] [@equal.ignore] [@sexp.opaque])
- 401 |     ]
- Warning 56 [unreachable-case]: this match case is unreachable.
- Consider replacing it with a refutation case '<pat> -> .'
-> compiled  base.v0.18~preview.130.36+326
-> installed base.v0.18~preview.130.36+326
Processing 105/108: [stdio: dune build]
+ /home/opam/.opam/opam-init/hooks/sandbox.sh "build" "dune" "build" "-p" "stdio" "-j" "71" (CWD=/home/opam/.opam/5.2.0+flambda2/.opam-switch/build/stdio.v0.18~preview.130.36+326)
-> compiled  stdio.v0.18~preview.130.36+326
-> installed stdio.v0.18~preview.130.36+326
Processing 107/108: [guile: dune build]
+ /home/opam/.opam/opam-init/hooks/sandbox.sh "build" "dune" "build" "-p" "guile" "-j" "71" "--promote-install-files=false" "@install" (CWD=/home/opam/.opam/5.2.0+flambda2/.opam-switch/build/guile.1.0)
[ERROR] The compilation of guile.1.0 failed at "dune build -p guile -j 71 --promote-install-files=false @install".

#=== ERROR while compiling guile.1.0 ==========================================#
# context              2.4.1 | linux/x86_64 | ocaml-variants.5.2.0+ox | file:///home/opam/opam-repository
# path                 ~/.opam/5.2.0+flambda2/.opam-switch/build/guile.1.0
# command              ~/.opam/opam-init/hooks/sandbox.sh build dune build -p guile -j 71 --promote-install-files=false @install
# exit-code            1
# env-file             ~/.opam/log/guile-8-2c937b.env
# output-file          ~/.opam/log/guile-8-2c937b.out
### output ###
# File "stubgen/dune", lines 12-16, characters 0-263:
# 12 | (rule (targets bindings_stubs_gen.exe)
# 13 |  (deps bindings_stubs_gen.c c_flags c_library_flags)
# 14 |  (action
# 15 |   (bash
# 16 |     "%{cc} bindings_stubs_gen.c -I `dirname %{lib:ctypes:ctypes_cstubs_internals.h}` -I %{ocaml_where} $(< c_flags) $(< c_library_flags) -o %{targets}")))
# (cd _build/default/stubgen && /usr/bin/bash -e -u -o pipefail -c 'gcc -O2 -fno-strict-aliasing -fwrapv -pthread -fPIC -pthread -D_FILE_OFFSET_BITS=64 -Wall -fdiagnostics-color=always bindings_stubs_gen.c -I `dirname /home/opam/.opam/5.2.0+flambda2/lib/ctypes/ctypes_cstubs_internals.h` -I /home/opam/.opam/5.2.0+flambda2/lib/ocaml $(< c_flags) $(< c_library_flags) -o bindings_stubs_gen.exe')
# bindings_stubs_gen.c: In function 'main':
# bindings_stubs_gen.c:35:41: warning: cast from pointer to integer of different size [-Wpointer-to-int-cast]
#    35 |      enum { check_SCM_UNDEFINED_const = (int)SCM_UNDEFINED };
#       |                                         ^
# bindings_stubs_gen.c:36:19: error: initialization of 'intptr_t' {aka 'long int'} from 'struct scm_unused_struct *' makes integer from pointer without a cast [-Wint-conversion]
#    36 |      intptr_t v = (SCM_UNDEFINED);
#       |                   ^
# bindings_stubs_gen.c:42:35: warning: cast from pointer to integer of different size [-Wpointer-to-int-cast]
#    42 |      enum { check_SCM_EOL_const = (int)SCM_EOL };
#       |                                   ^
# bindings_stubs_gen.c:43:19: error: initialization of 'intptr_t' {aka 'long int'} from 'struct scm_unused_struct *' makes integer from pointer without a cast [-Wint-conversion]
#    43 |      intptr_t v = (SCM_EOL);
#       |                   ^
# bindings_stubs_gen.c:49:38: warning: cast from pointer to integer of different size [-Wpointer-to-int-cast]
#    49 |      enum { check_SCM_BOOL_T_const = (int)SCM_BOOL_T };
#       |                                      ^
# bindings_stubs_gen.c:50:19: error: initialization of 'intptr_t' {aka 'long int'} from 'struct scm_unused_struct *' makes integer from pointer without a cast [-Wint-conversion]
#    50 |      intptr_t v = (SCM_BOOL_T);
#       |                   ^
# bindings_stubs_gen.c:56:38: warning: cast from pointer to integer of different size [-Wpointer-to-int-cast]
#    56 |      enum { check_SCM_BOOL_F_const = (int)SCM_BOOL_F };
#       |                                      ^
# bindings_stubs_gen.c:57:19: error: initialization of 'intptr_t' {aka 'long int'} from 'struct scm_unused_struct *' makes integer from pointer without a cast [-Wint-conversion]
#    57 |      intptr_t v = (SCM_BOOL_F);
#       |                   ^

- File "stubgen/dune", lines 12-16, characters 0-263:
- 12 | (rule (targets bindings_stubs_gen.exe)
- 13 |  (deps bindings_stubs_gen.c c_flags c_library_flags)
- 14 |  (action
- 15 |   (bash
- 16 |     "%{cc} bindings_stubs_gen.c -I `dirname %{lib:ctypes:ctypes_cstubs_internals.h}` -I %{ocaml_where} $(< c_flags) $(< c_library_flags) -o %{targets}")))
- (cd _build/default/stubgen && /usr/bin/bash -e -u -o pipefail -c 'gcc -O2 -fno-strict-aliasing -fwrapv -pthread -fPIC -pthread -D_FILE_OFFSET_BITS=64 -Wall -fdiagnostics-color=always bindings_stubs_gen.c -I `dirname /home/opam/.opam/5.2.0+flambda2/lib/ctypes/ctypes_cstubs_internals.h` -I /home/opam/.opam/5.2.0+flambda2/lib/ocaml $(< c_flags) $(< c_library_flags) -o bindings_stubs_gen.exe')
- bindings_stubs_gen.c: In function 'main':
- bindings_stubs_gen.c:35:41: warning: cast from pointer to integer of different size [-Wpointer-to-int-cast]
-    35 |      enum { check_SCM_UNDEFINED_const = (int)SCM_UNDEFINED };
-       |                                         ^
- bindings_stubs_gen.c:36:19: error: initialization of 'intptr_t' {aka 'long int'} from 'struct scm_unused_struct *' makes integer from pointer without a cast [-Wint-conversion]
-    36 |      intptr_t v = (SCM_UNDEFINED);
-       |                   ^
- bindings_stubs_gen.c:42:35: warning: cast from pointer to integer of different size [-Wpointer-to-int-cast]
-    42 |      enum { check_SCM_EOL_const = (int)SCM_EOL };
-       |                                   ^
- bindings_stubs_gen.c:43:19: error: initialization of 'intptr_t' {aka 'long int'} from 'struct scm_unused_struct *' makes integer from pointer without a cast [-Wint-conversion]
-    43 |      intptr_t v = (SCM_EOL);
-       |                   ^
- bindings_stubs_gen.c:49:38: warning: cast from pointer to integer of different size [-Wpointer-to-int-cast]
-    49 |      enum { check_SCM_BOOL_T_const = (int)SCM_BOOL_T };
-       |                                      ^
- bindings_stubs_gen.c:50:19: error: initialization of 'intptr_t' {aka 'long int'} from 'struct scm_unused_struct *' makes integer from pointer without a cast [-Wint-conversion]
-    50 |      intptr_t v = (SCM_BOOL_T);
-       |                   ^
- bindings_stubs_gen.c:56:38: warning: cast from pointer to integer of different size [-Wpointer-to-int-cast]
-    56 |      enum { check_SCM_BOOL_F_const = (int)SCM_BOOL_F };
-       |                                      ^
- bindings_stubs_gen.c:57:19: error: initialization of 'intptr_t' {aka 'long int'} from 'struct scm_unused_struct *' makes integer from pointer without a cast [-Wint-conversion]
-    57 |      intptr_t v = (SCM_BOOL_F);
-       |                   ^


<><> Error report <><><><><><><><><><><><><><><><><><><><><><><><><><><><><><><>
+- The following actions failed
| - build guile 1.0
+- 
+- The following changes have been performed
| - install base                    v0.18~preview.130.36+326
| - install basement                v0.18~preview.130.36+326
| - install bigarray-compat         1.1.0
| - install conf-bash               1
| - install conf-gmp                5
| - install conf-guile              1
| - install conf-libffi             2.0.0
| - install conf-pkg-config         4
| - install csexp                   1.5.2
| - install ctypes                  0.23.0
| - install ctypes-foreign          0.23.0
| - install dune                    3.19.1
| - install dune-configurator       3.19.1
| - install integers                0.7.0
| - install num                     1.6
| - install ocaml-compiler-libs     v0.17.0+ox
| - install ocaml_intrinsics_kernel v0.18~preview.130.36+326
| - install parsexp                 v0.18~preview.130.36+326
| - install ppx_base                v0.18~preview.130.36+326
| - install ppx_cold                v0.18~preview.130.36+326
| - install ppx_compare             v0.18~preview.130.36+326
| - install ppx_derivers            1.2.1
| - install ppx_enumerate           v0.18~preview.130.36+326
| - install ppx_globalize           v0.18~preview.130.36+326
| - install ppx_hash                v0.18~preview.130.36+326
| - install ppx_helpers             v0.18~preview.130.36+326
| - install ppx_sexp_conv           v0.18~preview.130.36+326
| - install ppx_shorthand           v0.18~preview.130.36+326
| - install ppx_template            v0.18~preview.130.36+326
| - install ppxlib                  0.33.0+ox
| - install ppxlib_ast              0.33.0+ox
| - install ppxlib_jane             v0.18~preview.130.36+326
| - install sexplib                 v0.18~preview.130.36+326
| - install sexplib0                v0.18~preview.130.36+326
| - install stdio                   v0.18~preview.130.36+326
| - install stdlib-shims            0.3.0
+- 
# To update the current shell environment, run: eval $(opam env)

The former state can be restored with:
    /usr/bin/opam switch import "/home/opam/.opam/5.2.0+flambda2/.opam-switch/backup/state-20250807080218.export"
'opam install -vy guile.1.0' failed.
"/usr/bin/env" "bash" "-c" "opam remove -y guile.1.0
opam install -vy guile.1.0
res=$?
if [ $res = 31 ]; then
    if opam show -f x-ci-accept-failures: guile.1.0 | grep -q 'debian-unstable'; then
        echo "This package failed and has been disabled for CI using the 'x-ci-accept-failures' field."
        exit 69
    fi
fi 


exit $res" failed with exit status 31
Failed: Build failed