OCamllabs icon Home|Differences with the last checks|Previous runs


Building on eumache

(from ocaml/opam:debian-unstable)
Unable to find image 'ocaml/opam:debian-unstable' locally
debian-unstable: Pulling from ocaml/opam
f6fae32d1855: Already exists
2b6b54cb75df: Already exists
7f4f75d80dc4: Already exists
86f2c2d376f7: Already exists
5fce5bf93f18: Already exists
91d6c59c3ffe: Already exists
9780bb50741d: Already exists
51f01f04294b: Already exists
46b42b345cac: Already exists
1dd5551ce92c: Already exists
55008ed07edc: Already exists
c1e792eee16f: Already exists
b2a816a70be2: Already exists
64b40eba7a69: Already exists
11491332e35e: Already exists
3314a0772c11: Already exists
9ba5ca987e73: Already exists
a5233de9b1e5: Already exists
bc6dd62b0adb: Already exists
17089b4923c4: Already exists
4dc2bdc414fd: Already exists
4f4fb700ef54: Already exists
1778f929414c: Already exists
21b3034f3560: Already exists
abe40b09cbf3: Already exists
1b0f9717b4f3: Already exists
46bab8457678: Already exists
f75badf20e81: Already exists
92b4348edd65: Already exists
f8b463772393: Already exists
dad7d278149c: Already exists
0ef56c176f19: Already exists
3fe17d841d7c: Already exists
cc682b2328b3: Already exists
f7c09bb9eac2: Already exists
8d492df13af5: Already exists
662d55711822: Already exists
d6cf62251a72: Already exists
d4bb9947b77b: Already exists
27daec8f3c08: Already exists
55b11b2bcb90: Already exists
a81f69018a14: Already exists
8af2fc2aec5d: Already exists
513e8402745e: Already exists
fd135f97ec6f: Already exists
bdd7d5de62c2: Already exists
382b95d961ba: Already exists
Digest: sha256:867738023289fd26cdb69fad77687cf4ed3a8bf60dcddabdf3cc53c705746fd2
Status: Downloaded newer image for ocaml/opam:debian-unstable
2025-08-07 07:31.14 ---> saved as "0acd5aeaa8f7bc314514d9795d14a7f12ec72a6a5b11c5904350189734c6859b"

/: (user (uid 1000) (gid 1000))

/: (env OPAMPRECISETRACKING 1)

/: (env OPAMUTF8 never)

/: (env OPAMEXTERNALSOLVER builtin-0install)

/: (env OPAMCRITERIA +removed)

/: (env CI true)

/: (env OPAM_HEALTH_CHECK_CI true)

/: (run (shell "sudo ln -f /usr/bin/opam-dev /usr/bin/opam"))
2025-08-07 07:31.15 ---> saved as "40df4fa4cdfc68a5fa7a326047e82a7adc5df52b8059d4a7b745bdd50aad56e7"

/: (run (network host)
        (shell "rm -rf ~/opam-repository && git clone -q 'https://github.com/ocaml/opam-repository' ~/opam-repository && git -C ~/opam-repository checkout -q 06a1064b82e87c7ef006235ec98f1c89487892c9"))
2025-08-07 07:32.16 ---> saved as "190c02cbe0dbf4a8b0af5361aa9e25640f87291c4fe861cc6cf855e0fda3a8c0"

/: (run (shell "rm -rf ~/.opam && opam init -ya --bare --config ~/.opamrc-sandbox ~/opam-repository"))
Configuring from /home/opam/.opamrc-sandbox, then /home/opam/.opamrc, and finally from built-in defaults.
Checking for available remotes: rsync and local, git.
  - you won't be able to use mercurial repositories unless you install the hg command on your system.
  - you won't be able to use darcs repositories unless you install the darcs command on your system.


<><> Fetching repository information ><><><><><><><><><><><><><><><><><><><><><>
[default] Initialised

User configuration:
  ~/.profile is already up-to-date.
[NOTE] Make sure that ~/.profile is well sourced in your ~/.bashrc.

2025-08-07 07:33.02 ---> saved as "012c52728bded521bf1d53a4382a5dac829cfe1a6f3ed7b53cc733c53b2d91cb"

/: (run (cache (opam-archives (target /home/opam/.opam/download-cache)))
        (network host)
        (shell "sudo apt update && sudo apt install autoconf -y"))

WARNING: apt does not have a stable CLI interface. Use with caution in scripts.

Get:1 http://deb.debian.org/debian unstable InRelease [216 kB]
Get:2 http://deb.debian.org/debian unstable/main amd64 Packages.diff/Index [63.6 kB]
Get:3 http://deb.debian.org/debian unstable/main amd64 Packages T-2025-08-07-0205.44-F-2025-08-02-0804.37.pdiff [69.1 kB]
Get:3 http://deb.debian.org/debian unstable/main amd64 Packages T-2025-08-07-0205.44-F-2025-08-02-0804.37.pdiff [69.1 kB]
Fetched 348 kB in 2s (162 kB/s)
Reading package lists...
Building dependency tree...
Reading state information...
4 packages can be upgraded. Run 'apt list --upgradable' to see them.

WARNING: apt does not have a stable CLI interface. Use with caution in scripts.

Reading package lists...
Building dependency tree...
Reading state information...
Installing:
  autoconf

Installing dependencies:
  automake  autotools-dev  m4

Suggested packages:
  autoconf-archive  gnu-standards  autoconf-doc  libtool  gettext  m4-doc

Summary:
  Upgrading: 0, Installing: 4, Removing: 0, Not Upgrading: 4
  Download size: 1710 kB
  Space needed: 5051 kB / 230 GB available

Get:1 http://deb.debian.org/debian unstable/main amd64 m4 amd64 1.4.19-8 [294 kB]
Get:2 http://deb.debian.org/debian unstable/main amd64 autoconf all 2.72-3.1 [494 kB]
Get:3 http://deb.debian.org/debian unstable/main amd64 autotools-dev all 20240727.1 [60.2 kB]
Get:4 http://deb.debian.org/debian unstable/main amd64 automake all 1:1.17-4 [862 kB]
Fetched 1710 kB in 0s (30.8 MB/s)
Selecting previously unselected package m4.
(Reading database ... 
(Reading database ... 5%
(Reading database ... 10%
(Reading database ... 15%
(Reading database ... 20%
(Reading database ... 25%
(Reading database ... 30%
(Reading database ... 35%
(Reading database ... 40%
(Reading database ... 45%
(Reading database ... 50%
(Reading database ... 55%
(Reading database ... 60%
(Reading database ... 65%
(Reading database ... 70%
(Reading database ... 75%
(Reading database ... 80%
(Reading database ... 85%
(Reading database ... 90%
(Reading database ... 95%
(Reading database ... 100%
(Reading database ... 20685 files and directories currently installed.)
Preparing to unpack .../archives/m4_1.4.19-8_amd64.deb ...
Unpacking m4 (1.4.19-8) ...
Selecting previously unselected package autoconf.
Preparing to unpack .../autoconf_2.72-3.1_all.deb ...
Unpacking autoconf (2.72-3.1) ...
Selecting previously unselected package autotools-dev.
Preparing to unpack .../autotools-dev_20240727.1_all.deb ...
Unpacking autotools-dev (20240727.1) ...
Selecting previously unselected package automake.
Preparing to unpack .../automake_1%3a1.17-4_all.deb ...
Unpacking automake (1:1.17-4) ...
Setting up m4 (1.4.19-8) ...
Setting up autotools-dev (20240727.1) ...
Setting up autoconf (2.72-3.1) ...
Setting up automake (1:1.17-4) ...
update-alternatives: using /usr/bin/automake-1.17 to provide /usr/bin/automake (automake) in auto mode
2025-08-07 07:33.07 ---> saved as "159374d4dfbeb7f87b486ade5afe9a00b3d6b0bdba42573a1887cdb5e30fe45b"

/: (run (network host)
        (shell "git clone -q 'https://github.com/oxcaml/opam-repository' ~/'oxcaml' && git -C ~/'oxcaml' checkout -q 29656e8e76b4441b5b62db11d35d193e380298ca"))
2025-08-07 07:33.10 ---> saved as "b5848cf3bbbc0c4981e5d5e3d9bcec3b4c6b4225e188081cd30294eec97db7b4"

/: (run (shell "opam repository add --dont-select 'oxcaml' ~/'oxcaml'"))
[oxcaml] Initialised
2025-08-07 07:33.11 ---> saved as "c846a1cc387dcbe1a71e6838f59ad7ff1920eabe18952f84a40fd0b2a4641443"

/: (run (cache (opam-archives (target /home/opam/.opam/download-cache)))
        (network host)
        (shell "opam switch create --repositories=oxcaml,default '5.2.0+flambda2' '5.2.0+ox'"))

<><> Installing new switch packages <><><><><><><><><><><><><><><><><><><><><><>
Switch invariant: ["ocaml-variants" {= "5.2.0+ox"}]

<><> Processing actions <><><><><><><><><><><><><><><><><><><><><><><><><><><><>
-> retrieved ocaml-config.3  (cached)
-> installed base-bigarray.base
-> installed base-threads.base
-> installed base-unix.base
-> installed ocaml-options-vanilla.1
-> installed conf-autoconf.0.2
-> installed conf-which.1
-> retrieved ocaml-variants.5.2.0+ox  (https://github.com/oxcaml/oxcaml/archive/refs/tags/5.2.0minus-11-opam.tar.gz)
-> installed ocaml-variants.5.2.0+ox
-> installed ocaml-config.3
-> installed ocaml.5.2.0
-> installed base-domains.base
-> installed base-nnp.base
Done.
# To update the current shell environment, run: eval $(opam env --switch=5.2.0+flambda2)
2025-08-07 07:42.27 ---> saved as "059e4c8d9fde813aed5ba328af1b91f6cd5242b6bc0b704a2be07cd5d14bb4e8"

/: (run (network host)
        (shell "opam update --depexts"))
+ /usr/bin/sudo "apt-get" "update"
- Hit:1 http://deb.debian.org/debian unstable InRelease
- Reading package lists...
2025-08-07 07:42.28 ---> saved as "7b9500581933009c35fa6ed9ef22a28eda258d356f0b06a637af33ddf697e0af"

/: (run (cache (opam-archives (target /home/opam/.opam/download-cache)))
        (network host)
        (shell  "opam remove -y ahrocksdb.0.2.2\
               \nopam install -vy ahrocksdb.0.2.2\
               \nres=$?\
               \nif [ $res = 31 ]; then\
               \n    if opam show -f x-ci-accept-failures: ahrocksdb.0.2.2 | grep -q 'debian-unstable'; then\
               \n        echo \"This package failed and has been disabled for CI using the 'x-ci-accept-failures' field.\"\
               \n        exit 69\
               \n    fi\
               \nfi \
               \n\
               \n\
               \nexit $res"))
[NOTE] ahrocksdb.0.2.2 is not installed.

Nothing to do.
The following actions will be performed:
=== install 14 packages
  - install ahrocksdb         0.2.2
  - install astring           0.8.5     [required by ahrocksdb]
  - install bigarray-compat   1.1.0     [required by ctypes]
  - install conf-rocksdb      1         [required by ahrocksdb]
  - install csexp             1.5.2     [required by dune-configurator]
  - install ctypes            0.23.0    [required by ahrocksdb]
  - install dune              3.19.1    [required by ahrocksdb]
  - install dune-configurator 3.19.1    [required by ahrocksdb]
  - install integers          0.7.0     [required by ctypes]
  - install ocamlbuild        0.15.0+ox [required by astring, rresult]
  - install ocamlfind         1.9.8     [required by astring, rresult]
  - install rresult           0.7.0     [required by ahrocksdb]
  - install stdlib-shims      0.3.0     [required by integers]
  - install topkg             1.0.8+ox  [required by astring, rresult]

The following system packages will first need to be installed:
    librocksdb-dev

<><> Handling external dependencies <><><><><><><><><><><><><><><><><><><><><><>

opam believes some required external dependencies are missing. opam can:
> 1. Run apt-get to install them (may need root/sudo access)
  2. Display the recommended apt-get command and wait while you run it manually (e.g. in another terminal)
  3. Continue anyway, and, upon success, permanently register that this external dependency is present, but not detectable
  4. Abort the installation

[1/2/3/4] 1

+ /usr/bin/sudo "apt-get" "install" "-qq" "-yy" "librocksdb-dev"
- Selecting previously unselected package bzip2-doc.
- (Reading database ... 
(Reading database ... 5%
(Reading database ... 10%
(Reading database ... 15%
(Reading database ... 20%
(Reading database ... 25%
(Reading database ... 30%
(Reading database ... 35%
(Reading database ... 40%
(Reading database ... 45%
(Reading database ... 50%
(Reading database ... 55%
(Reading database ... 60%
(Reading database ... 65%
(Reading database ... 70%
(Reading database ... 75%
(Reading database ... 80%
(Reading database ... 85%
(Reading database ... 90%
(Reading database ... 95%
(Reading database ... 100%
(Reading database ... 21005 files and directories currently installed.)
- Preparing to unpack .../00-bzip2-doc_1.0.8-6_all.deb ...
- Unpacking bzip2-doc (1.0.8-6) ...
- Selecting previously unselected package libbz2-dev:amd64.
- Preparing to unpack .../01-libbz2-dev_1.0.8-6_amd64.deb ...
- Unpacking libbz2-dev:amd64 (1.0.8-6) ...
- Selecting previously unselected package libgflags2.2.
- Preparing to unpack .../02-libgflags2.2_2.2.2-2_amd64.deb ...
- Unpacking libgflags2.2 (2.2.2-2) ...
- Selecting previously unselected package libgflags-dev.
- Preparing to unpack .../03-libgflags-dev_2.2.2-2_amd64.deb ...
- Unpacking libgflags-dev (2.2.2-2) ...
- Selecting previously unselected package libxxhash-dev:amd64.
- Preparing to unpack .../04-libxxhash-dev_0.8.3-2_amd64.deb ...
- Unpacking libxxhash-dev:amd64 (0.8.3-2) ...
- Selecting previously unselected package liblz4-dev:amd64.
- Preparing to unpack .../05-liblz4-dev_1.10.0-4_amd64.deb ...
- Unpacking liblz4-dev:amd64 (1.10.0-4) ...
- Selecting previously unselected package libsnappy1v5:amd64.
- Preparing to unpack .../06-libsnappy1v5_1.2.2-1_amd64.deb ...
- Unpacking libsnappy1v5:amd64 (1.2.2-1) ...
- Selecting previously unselected package librocksdb9.10.
- Preparing to unpack .../07-librocksdb9.10_9.10.0-1+b1_amd64.deb ...
- Unpacking librocksdb9.10 (9.10.0-1+b1) ...
- Selecting previously unselected package libsnappy-dev:amd64.
- Preparing to unpack .../08-libsnappy-dev_1.2.2-1_amd64.deb ...
- Unpacking libsnappy-dev:amd64 (1.2.2-1) ...
- Selecting previously unselected package zlib1g-dev:amd64.
- Preparing to unpack .../09-zlib1g-dev_1%3a1.3.dfsg+really1.3.1-1+b1_amd64.deb ...
- Unpacking zlib1g-dev:amd64 (1:1.3.dfsg+really1.3.1-1+b1) ...
- Selecting previously unselected package librocksdb-dev.
- Preparing to unpack .../10-librocksdb-dev_9.10.0-1+b1_amd64.deb ...
- Unpacking librocksdb-dev (9.10.0-1+b1) ...
- Setting up bzip2-doc (1.0.8-6) ...
- Setting up libsnappy1v5:amd64 (1.2.2-1) ...
- Setting up libxxhash-dev:amd64 (0.8.3-2) ...
- Setting up zlib1g-dev:amd64 (1:1.3.dfsg+really1.3.1-1+b1) ...
- Setting up libgflags2.2 (2.2.2-2) ...
- Setting up libbz2-dev:amd64 (1.0.8-6) ...
- Setting up libsnappy-dev:amd64 (1.2.2-1) ...
- Setting up libgflags-dev (2.2.2-2) ...
- Setting up liblz4-dev:amd64 (1.10.0-4) ...
- Setting up librocksdb9.10 (9.10.0-1+b1) ...
- Setting up librocksdb-dev (9.10.0-1+b1) ...
- Processing triggers for libc-bin (2.41-11) ...

<><> Processing actions <><><><><><><><><><><><><><><><><><><><><><><><><><><><>
Processing  1/41: [ahrocksdb.0.2.2: extract]
Processing  2/41: [ahrocksdb.0.2.2: extract] [astring.0.8.5: extract]
Processing  3/41: [ahrocksdb.0.2.2: extract] [astring.0.8.5: extract] [bigarray-compat.1.1.0: extract]
-> retrieved ahrocksdb.0.2.2  (cached)
Processing  3/41: [astring.0.8.5: extract] [bigarray-compat.1.1.0: extract]
-> retrieved conf-rocksdb.1  (cached)
Processing  4/41: [astring.0.8.5: extract] [bigarray-compat.1.1.0: extract]
Processing  5/41: [astring.0.8.5: extract] [bigarray-compat.1.1.0: extract] [csexp.1.5.2: extract]
Processing  6/41: [astring.0.8.5: extract] [bigarray-compat.1.1.0: extract] [csexp.1.5.2: extract] [conf-rocksdb: cc main.c]
-> retrieved astring.0.8.5  (cached)
Processing  6/41: [bigarray-compat.1.1.0: extract] [csexp.1.5.2: extract] [conf-rocksdb: cc main.c]
Processing  7/41: [bigarray-compat.1.1.0: extract] [csexp.1.5.2: extract] [ctypes.0.23.0: extract] [conf-rocksdb: cc main.c]
-> retrieved bigarray-compat.1.1.0  (cached)
Processing  7/41: [csexp.1.5.2: extract] [ctypes.0.23.0: extract] [conf-rocksdb: cc main.c]
Processing  8/41: [csexp.1.5.2: extract] [ctypes.0.23.0: extract] [dune.3.19.1, dune-configurator.3.19.1: extract] [conf-rocksdb: cc main.c]
-> retrieved csexp.1.5.2  (cached)
Processing  8/41: [ctypes.0.23.0: extract] [dune.3.19.1, dune-configurator.3.19.1: extract] [conf-rocksdb: cc main.c]
Processing  9/41: [ctypes.0.23.0: extract] [dune.3.19.1, dune-configurator.3.19.1: extract] [integers.0.7.0: extract] [conf-rocksdb: cc main.c]
-> retrieved ctypes.0.23.0  (cached)
Processing  9/41: [dune.3.19.1, dune-configurator.3.19.1: extract] [integers.0.7.0: extract] [conf-rocksdb: cc main.c]
Processing 10/41: [dune.3.19.1, dune-configurator.3.19.1: extract] [integers.0.7.0: extract] [ocamlbuild.0.15.0+ox: http] [conf-rocksdb: cc main.c]
+ /home/opam/.opam/opam-init/hooks/sandbox.sh "build" "cc" "-lrocksdb" "main.c" (CWD=/home/opam/.opam/5.2.0+flambda2/.opam-switch/build/conf-rocksdb.1)
-> compiled  conf-rocksdb.1
Processing 10/41: [dune.3.19.1, dune-configurator.3.19.1: extract] [integers.0.7.0: extract] [ocamlbuild.0.15.0+ox: http]
-> installed conf-rocksdb.1
Processing 11/41: [dune.3.19.1, dune-configurator.3.19.1: extract] [integers.0.7.0: extract] [ocamlbuild.0.15.0+ox: http]
-> retrieved integers.0.7.0  (cached)
Processing 11/41: [dune.3.19.1, dune-configurator.3.19.1: extract] [ocamlbuild.0.15.0+ox: http]
Processing 12/41: [dune.3.19.1, dune-configurator.3.19.1: extract] [ocamlbuild.0.15.0+ox: http] [ocamlfind.1.9.8: extract]
-> retrieved ocamlfind.1.9.8  (cached)
Processing 12/41: [dune.3.19.1, dune-configurator.3.19.1: extract] [ocamlbuild.0.15.0+ox: http]
Processing 13/41: [dune.3.19.1, dune-configurator.3.19.1: extract] [ocamlbuild.0.15.0+ox: http] [rresult.0.7.0: extract]
Processing 14/41: [dune.3.19.1, dune-configurator.3.19.1: extract] [ocamlbuild.0.15.0+ox: http] [rresult.0.7.0: extract] [ocamlfind: ./configure]
-> retrieved rresult.0.7.0  (cached)
Processing 14/41: [dune.3.19.1, dune-configurator.3.19.1: extract] [ocamlbuild.0.15.0+ox: http] [ocamlfind: ./configure]
Processing 15/41: [dune.3.19.1, dune-configurator.3.19.1: extract] [ocamlbuild.0.15.0+ox: http] [stdlib-shims.0.3.0: extract] [ocamlfind: ./configure]
-> retrieved stdlib-shims.0.3.0  (cached)
Processing 15/41: [dune.3.19.1, dune-configurator.3.19.1: extract] [ocamlbuild.0.15.0+ox: http] [ocamlfind: ./configure]
Processing 16/41: [dune.3.19.1, dune-configurator.3.19.1: extract] [ocamlbuild.0.15.0+ox: http] [topkg.1.0.8+ox: extract] [ocamlfind: ./configure]
-> retrieved topkg.1.0.8+ox  (cached)
Processing 16/41: [dune.3.19.1, dune-configurator.3.19.1: extract] [ocamlbuild.0.15.0+ox: http] [ocamlfind: ./configure]
Processing 16/41: [dune.3.19.1, dune-configurator.3.19.1: extract] [ocamlbuild.0.15.0+ox: extract] [ocamlfind: ./configure]
-> retrieved ocamlbuild.0.15.0+ox  (https://github.com/ocaml/ocamlbuild/archive/refs/tags/0.15.0.tar.gz)
Processing 16/41: [dune.3.19.1, dune-configurator.3.19.1: extract] [ocamlfind: ./configure]
[ocamlbuild: patch] applying flambda2.patch
Processing 17/41: [dune.3.19.1, dune-configurator.3.19.1: extract] [ocamlbuild: make configure.make] [ocamlfind: ./configure]
+ /home/opam/.opam/opam-init/hooks/sandbox.sh "build" "make" "-f" "configure.make" "all" "OCAMLBUILD_PREFIX=/home/opam/.opam/5.2.0+flambda2" "OCAMLBUILD_BINDIR=/home/opam/.opam/5.2.0+flambda2/bin" "OCAMLBUILD_LIBDIR=/home/opam/.opam/5.2.0+flambda2/lib" "OCAMLBUILD_MANDIR=/home/opam/.opam/5.2.0+flambda2/man" "OCAML_NATIVE=true" "OCAML_NATIVE_TOOLS=true" (CWD=/home/opam/.opam/5.2.0+flambda2/.opam-switch/build/ocamlbuild.0.15.0+ox)
- (echo "# This file was generated from configure.make"; \
- echo ;\
- echo "OCAML_PREFIX="; \
- echo "OCAML_BINDIR=/home/opam/.opam/5.2.0+flambda2/bin"; \
- echo "OCAML_LIBDIR=/home/opam/.opam/5.2.0+flambda2/lib/ocaml"; \
- echo "OCAML_MANDIR=/home/opam/.opam/5.2.0+flambda2/man"; \
- echo ;\
- echo "EXT_OBJ=.o"; \
- echo "EXT_ASM=.s"; \
- echo "EXT_LIB=.a"; \
- echo "EXT_DLL=.so"; \
- echo "EXE="; \
- echo ;\
- echo "OCAML_NATIVE=true"; \
- echo "OCAML_NATIVE_TOOLS=true"; \
- echo "NATDYNLINK=true"; \
- echo "SUPPORT_SHARED_LIBRARIES=true"; \
- echo ;\
- echo "PREFIX=/home/opam/.opam/5.2.0+flambda2"; \
- echo "BINDIR=/home/opam/.opam/5.2.0+flambda2/bin"; \
- echo "LIBDIR=/home/opam/.opam/5.2.0+flambda2/lib"; \
- echo "MANDIR=/home/opam/.opam/5.2.0+flambda2/man"; \
- ) > Makefile.config
- (echo "(* This file was generated from ../configure.make *)"; \
- echo ;\
- echo 'let bindir = {|/home/opam/.opam/5.2.0+flambda2/bin|}'; \
- echo 'let libdir = {|/home/opam/.opam/5.2.0+flambda2/lib|}'; \
- echo 'let ocaml_libdir = {|/home/opam/.opam/5.2.0+flambda2/lib/ocaml|}'; \
- echo 'let libdir_abs = {|/home/opam/.opam/5.2.0+flambda2/lib|}'; \
- echo 'let ocaml_native = true'; \
- echo 'let ocaml_native_tools = true'; \
- echo 'let supports_shared_libraries = true';\
- echo 'let a = "a"'; \
- echo 'let o = "o"'; \
- echo 'let so = "so"'; \
- echo 'let ext_dll = ".so"'; \
- echo 'let exe = ""'; \
- echo 'let version = "0.15.0"'; \
- ) > src/ocamlbuild_config.ml
Processing 17/41: [dune.3.19.1, dune-configurator.3.19.1: extract] [ocamlbuild: make check-if-preinstalled] [ocamlfind: ./configure]
-> retrieved dune.3.19.1, dune-configurator.3.19.1  (cached)
Processing 17/41: [ocamlbuild: make check-if-preinstalled] [ocamlfind: ./configure]
Processing 18/41: [dune: ocaml 71] [ocamlbuild: make check-if-preinstalled] [ocamlfind: ./configure]
+ /home/opam/.opam/opam-init/hooks/sandbox.sh "build" "./configure" "-bindir" "/home/opam/.opam/5.2.0+flambda2/bin" "-sitelib" "/home/opam/.opam/5.2.0+flambda2/lib" "-mandir" "/home/opam/.opam/5.2.0+flambda2/man" "-config" "/home/opam/.opam/5.2.0+flambda2/lib/findlib.conf" "-no-custom" "-no-camlp4" (CWD=/home/opam/.opam/5.2.0+flambda2/.opam-switch/build/ocamlfind.1.9.8)
- Welcome to findlib version 1.9.8
- Configuring core...
- Checking for #remove_directory...
- Testing threading model...
- systhread_supported: true
- Testing DLLs...
- File "_none_", line 1:
- Error: Reference to undefined compilation unit "Stdlib__Mutex"
- Hint: This means that the interface of a module is loaded, but its implementation is not.
-       Did you mean to load a compiled implementation of the module 
-       using "#load" or by passing it as an argument to the toplevel?
- Testing whether ppxopt can be supported...
- Checking for ocamlc -opaque...
- Checking for ocamlopt -g...
- Configuring libraries...
- unix: found (in +unix)
- dynlink: found (in +dynlink)
- bigarray: not present (possible since 4.08)
- compiler-libs: found
- dbm: not present (normal since 4.00)
- graphics: not present (normal since 4.09)
- num: not present (normal since 4.06)
- ocamlbuild: not present (normal since 4.03)
- ocamldoc: not present
- raw_spacetime: not present (normal since 4.12)
- threads: found (in +threads)
- str: found (in +str)
- labltk: not present (normal since 4.02)
- native dynlink: found
- camlp4: disabled
- bytes: found, installing fake library
- Configuration for bytes written to site-lib-src/bytes/META
- Detecting compiler arguments: (extractor built) ok
- 
- About the OCAML core installation:
-     Standard library:      /home/opam/.opam/5.2.0+flambda2/lib/ocaml
-     Binaries:              /home/opam/.opam/5.2.0+flambda2/bin
-     Manual pages:          /usr/local/man
-     Multi-threading type:  posix
- The directory of site-specific packages will be
-     site-lib:              /home/opam/.opam/5.2.0+flambda2/lib
- The configuration file is written to:
-     findlib config file:   /home/opam/.opam/5.2.0+flambda2/lib/findlib.conf
- Software will be installed:
-     Libraries:             in <site-lib>/findlib
-     Binaries:              /home/opam/.opam/5.2.0+flambda2/bin
-     Manual pages:          /home/opam/.opam/5.2.0+flambda2/man
-     topfind script:        /home/opam/.opam/5.2.0+flambda2/lib/ocaml
- Topfind ppxopt support:    yes
- Toolbox:                   no
- Link custom runtime:       no
- Need bytes compatibility:  no
- 
- Configuration has been written to Makefile.config
- 
- You can now do 'make all', and optionally 'make opt', to build ocamlfind.
Processing 18/41: [dune: ocaml 71] [ocamlbuild: make check-if-preinstalled] [ocamlfind: make all]
+ /home/opam/.opam/opam-init/hooks/sandbox.sh "build" "make" "all" (CWD=/home/opam/.opam/5.2.0+flambda2/.opam-switch/build/ocamlfind.1.9.8)
- for p in findlib; do ( cd src/$p; make all ) || exit; done
- make[1]: Entering directory '/home/opam/.opam/5.2.0+flambda2/.opam-switch/build/ocamlfind.1.9.8/src/findlib'
- ocamllex fl_meta.mll
- 22 states, 392 transitions, table size 1700 bytes
- USE_CYGPATH="0"; \
- export USE_CYGPATH; \
- cat findlib_config.mlp | \
-          ../../tools/patch '@CONFIGFILE@' '/home/opam/.opam/5.2.0+flambda2/lib/findlib.conf' | \
-          ../../tools/patch '@STDLIB@' '/home/opam/.opam/5.2.0+flambda2/lib/ocaml' | \
-          ../../tools/patch '@RELATIVE_PATHS@' 'false' | \
- 	sed -e 's;@AUTOLINK@;true;g' \
- 	    -e 's;@SYSTEM@;linux;g' \
- 	     >findlib_config.ml
- if [ "true" = "true" ]; then                 \
- 	cp topfind.ml.in topfind.ml;                             \
- else                                                             \
- 	sed -e '/PPXOPT_BEGIN/,/PPXOPT_END/ d' topfind.ml.in     \
- 		> topfind.ml ;                                   \
- fi
- ocamldep *.ml *.mli >depend
- ocamlc -I +compiler-libs -opaque   -I +unix -I +dynlink -g -c fl_compat.ml
- ocamlc -I +compiler-libs -opaque   -I +unix -I +dynlink -g -c fl_split.ml
- ocamlc -I +compiler-libs -opaque   -I +unix -I +dynlink -g -c findlib_config.ml
- ocamlc -I +compiler-libs -opaque   -I +unix -I +dynlink -g -c fl_metatoken.ml
- ocamlc -I +compiler-libs -opaque   -I +unix -I +dynlink -g -c fl_meta.ml
- ocamlc -I +compiler-libs -opaque   -I +unix -I +dynlink -c fl_metascanner.mli
- ocamlc -I +compiler-libs -opaque   -I +unix -I +dynlink -g -c fl_metascanner.ml
- ocamlc -I +compiler-libs -opaque   -I +unix -I +dynlink -c fl_topo.mli
- ocamlc -I +compiler-libs -opaque   -I +unix -I +dynlink -g -c fl_topo.ml
- ocamlc -I +compiler-libs -opaque   -I +unix -I +dynlink -c fl_package_base.mli
- ocamlc -I +compiler-libs -opaque   -I +unix -I +dynlink -g -c fl_package_base.ml
- ocamlc -I +compiler-libs -opaque   -I +unix -I +dynlink -c findlib.mli
- ocamlc -I +compiler-libs -opaque   -I +unix -I +dynlink -g -c findlib.ml
- ocamlc -I +compiler-libs -opaque   -I +unix -I +dynlink -g -c fl_args.ml
- ocamlc -I +compiler-libs -opaque   -I +unix -I +dynlink -g -c fl_lint.ml
- ocamlc -I +compiler-libs -a -o findlib.cma fl_compat.cmo fl_split.cmo findlib_config.cmo fl_metatoken.cmo fl_meta.cmo fl_metascanner.cmo fl_topo.cmo fl_package_base.cmo findlib.cmo fl_args.cmo fl_lint.cmo
- ocamlc -I +compiler-libs -opaque   -I +unix -I +dynlink -g -c ocaml_args.ml
- ocamlc -I +compiler-libs -opaque   -I +unix -I +dynlink -g -c frontend.ml
- File "frontend.ml", line 385, characters 6-16:
- 385 |       Sys.signal Sys.sigint Sys.Signal_ignore in
-             ^^^^^^^^^^
- Alert unsafe_multidomain: Stdlib.Sys.signal
- Use [Sys.Safe.signal].
- 
- File "frontend.ml", line 428, characters 4-18:
- 428 |     Sys.set_signal Sys.sigint old_sigint;
-           ^^^^^^^^^^^^^^
- Alert unsafe_multidomain: Stdlib.Sys.set_signal
- Use [Sys.Safe.set_signal].
- ocamlc -I +compiler-libs  -o ocamlfind -g findlib.cma unix.cma \
-            -I +unix -I +dynlink ocaml_args.cmo frontend.cmo
- ocamlc -I +compiler-libs -opaque   -I +unix -I +dynlink -c topfind.mli
- ocamlc -I +compiler-libs -opaque   -I +unix -I +dynlink -g -c topfind.ml
- File "topfind.ml", line 128, characters 40-63:
- 128 |                      match Hashtbl.find Toploop.directive_table "ppx" with
-                                               ^^^^^^^^^^^^^^^^^^^^^^^
- Alert deprecated: Toploop.directive_table
- 
- File "topfind.ml", line 258, characters 4-27:
- 258 |     Toploop.directive_table
-           ^^^^^^^^^^^^^^^^^^^^^^^
- Alert deprecated: Toploop.directive_table
- 
- File "topfind.ml", line 268, characters 4-27:
- 268 |     Toploop.directive_table
-           ^^^^^^^^^^^^^^^^^^^^^^^
- Alert deprecated: Toploop.directive_table
- 
- File "topfind.ml", line 280, characters 4-27:
- 280 |     Toploop.directive_table
-           ^^^^^^^^^^^^^^^^^^^^^^^
- Alert deprecated: Toploop.directive_table
- 
- File "topfind.ml", line 293, characters 4-27:
- 293 |     Toploop.directive_table
-           ^^^^^^^^^^^^^^^^^^^^^^^
- Alert deprecated: Toploop.directive_table
- 
- File "topfind.ml", line 307, characters 4-27:
- 307 |     Toploop.directive_table
-           ^^^^^^^^^^^^^^^^^^^^^^^
- Alert deprecated: Toploop.directive_table
- 
- File "topfind.ml", line 319, characters 4-27:
- 319 |     Toploop.directive_table
-           ^^^^^^^^^^^^^^^^^^^^^^^
- Alert deprecated: Toploop.directive_table
- ocamlc -I +compiler-libs -a -o findlib_top.cma topfind.cmo
- if [ "1" = "1" ]; then                        \
- 	cp topfind.in topfind.compat.in;                                                     \
- else                                                                  \
- 	sed -e '/REMOVE_DIRECTORY_BEGIN/,/REMOVE_DIRECTORY_END/ d' topfind.in \
- 		> topfind.compat.in ;                                                \
- fi
- USE_CYGPATH="0"; \
- export USE_CYGPATH; \
- cat topfind.compat.in | \
-          ../../tools/patch '@SITELIB@' '/home/opam/.opam/5.2.0+flambda2/lib' | \
-          ../../tools/patch '@RELATIVE_PATHS@' 'false' \
-     	    >topfind
- ocamlc -I +compiler-libs -opaque   -I +unix -I +dynlink -c fl_dynload.mli
- ocamlc -I +compiler-libs -opaque   -I +unix -I +dynlink -g -c fl_dynload.ml
- ocamlc -I +compiler-libs -a -o findlib_dynload.cma fl_dynload.cmo
- make[1]: Leaving directory '/home/opam/.opam/5.2.0+flambda2/.opam-switch/build/ocamlfind.1.9.8/src/findlib'
- make all-config
- make[1]: Entering directory '/home/opam/.opam/5.2.0+flambda2/.opam-switch/build/ocamlfind.1.9.8'
- if [ "false" = "true" ]; then \
-   make findlib-relative; \
-         else \
-   make findlib-absolute; \
- fi
- make[2]: Entering directory '/home/opam/.opam/5.2.0+flambda2/.opam-switch/build/ocamlfind.1.9.8'
- USE_CYGPATH="0"; \
- export USE_CYGPATH; \
- cat findlib.conf.in | \
-      tools/patch '@SITELIB@' '/home/opam/.opam/5.2.0+flambda2/lib' | \
- 		 tools/patch '@FINDLIB_PATH@' '/home/opam/.opam/5.2.0+flambda2/lib/ocaml:/home/opam/.opam/5.2.0+flambda2/lib' -p >findlib.conf
- if ./tools/cmd_from_same_dir ocamlc; then \
- 	echo 'ocamlc="ocamlc.opt"' >>findlib.conf; \
- fi
- if ./tools/cmd_from_same_dir ocamlopt; then \
- 	echo 'ocamlopt="ocamlopt.opt"' >>findlib.conf; \
- fi
- if ./tools/cmd_from_same_dir ocamldep; then \
- 	echo 'ocamldep="ocamldep.opt"' >>findlib.conf; \
- fi
- if ./tools/cmd_from_same_dir ocamldoc; then \
- 	echo 'ocamldoc="ocamldoc.opt"' >>findlib.conf; \
- fi
- make[2]: Leaving directory '/home/opam/.opam/5.2.0+flambda2/.opam-switch/build/ocamlfind.1.9.8'
- make[1]: Leaving directory '/home/opam/.opam/5.2.0+flambda2/.opam-switch/build/ocamlfind.1.9.8'
Processing 18/41: [dune: ocaml 71] [ocamlbuild: make check-if-preinstalled] [ocamlfind: make opt]
+ /home/opam/.opam/opam-init/hooks/sandbox.sh "build" "make" "opt" (CWD=/home/opam/.opam/5.2.0+flambda2/.opam-switch/build/ocamlfind.1.9.8)
- for p in findlib; do ( cd src/$p; make opt ) || exit; done
- make[1]: Entering directory '/home/opam/.opam/5.2.0+flambda2/.opam-switch/build/ocamlfind.1.9.8/src/findlib'
- ocamlopt -I +compiler-libs -g -opaque  -I +unix -I +dynlink -c fl_compat.ml
- ocamlopt -I +compiler-libs -g -opaque  -I +unix -I +dynlink -c fl_split.ml
- ocamlopt -I +compiler-libs -g -opaque  -I +unix -I +dynlink -c findlib_config.ml
- ocamlopt -I +compiler-libs -g -opaque  -I +unix -I +dynlink -c fl_metatoken.ml
- ocamlopt -I +compiler-libs -g -opaque  -I +unix -I +dynlink -c fl_meta.ml
- ocamlopt -I +compiler-libs -g -opaque  -I +unix -I +dynlink -c fl_metascanner.ml
- ocamlopt -I +compiler-libs -g -opaque  -I +unix -I +dynlink -c fl_topo.ml
- ocamlopt -I +compiler-libs -g -opaque  -I +unix -I +dynlink -c fl_package_base.ml
- ocamlopt -I +compiler-libs -g -opaque  -I +unix -I +dynlink -c findlib.ml
- ocamlopt -I +compiler-libs -g -opaque  -I +unix -I +dynlink -c fl_args.ml
- ocamlopt -I +compiler-libs -g -opaque  -I +unix -I +dynlink -c fl_lint.ml
- ocamlopt -I +compiler-libs -g -a -o findlib.cmxa fl_compat.cmx fl_split.cmx findlib_config.cmx fl_metatoken.cmx fl_meta.cmx fl_metascanner.cmx fl_topo.cmx fl_package_base.cmx findlib.cmx fl_args.cmx fl_lint.cmx
- if [ 1 -gt 0 ]; then \
-     ocamlopt -I +compiler-libs -g -shared -o findlib.cmxs fl_compat.cmx fl_split.cmx findlib_config.cmx fl_metatoken.cmx fl_meta.cmx fl_metascanner.cmx fl_topo.cmx fl_package_base.cmx findlib.cmx fl_args.cmx fl_lint.cmx; \
- fi
- ocamlopt -I +compiler-libs -g -opaque  -I +unix -I +dynlink -c ocaml_args.ml
- ocamlopt -I +compiler-libs -g -opaque  -I +unix -I +dynlink -c frontend.ml
- File "frontend.ml", line 385, characters 6-16:
- 385 |       Sys.signal Sys.sigint Sys.Signal_ignore in
-             ^^^^^^^^^^
- Alert unsafe_multidomain: Stdlib.Sys.signal
- Use [Sys.Safe.signal].
- 
- File "frontend.ml", line 428, characters 4-18:
- 428 |     Sys.set_signal Sys.sigint old_sigint;
-           ^^^^^^^^^^^^^^
- Alert unsafe_multidomain: Stdlib.Sys.set_signal
- Use [Sys.Safe.set_signal].
- ocamlopt -I +compiler-libs -g -o ocamlfind_opt findlib.cmxa unix.cmxa \
- 	   -I +unix -I +dynlink ocaml_args.cmx frontend.cmx
- ocamlopt -I +compiler-libs -g -opaque  -I +unix -I +dynlink -c topfind.ml
- File "topfind.ml", line 128, characters 40-63:
- 128 |                      match Hashtbl.find Toploop.directive_table "ppx" with
-                                               ^^^^^^^^^^^^^^^^^^^^^^^
- Alert deprecated: Toploop.directive_table
- 
- File "topfind.ml", line 258, characters 4-27:
- 258 |     Toploop.directive_table
-           ^^^^^^^^^^^^^^^^^^^^^^^
- Alert deprecated: Toploop.directive_table
- 
- File "topfind.ml", line 268, characters 4-27:
- 268 |     Toploop.directive_table
-           ^^^^^^^^^^^^^^^^^^^^^^^
- Alert deprecated: Toploop.directive_table
- 
- File "topfind.ml", line 280, characters 4-27:
- 280 |     Toploop.directive_table
-           ^^^^^^^^^^^^^^^^^^^^^^^
- Alert deprecated: Toploop.directive_table
- 
- File "topfind.ml", line 293, characters 4-27:
- 293 |     Toploop.directive_table
-           ^^^^^^^^^^^^^^^^^^^^^^^
- Alert deprecated: Toploop.directive_table
- 
- File "topfind.ml", line 307, characters 4-27:
- 307 |     Toploop.directive_table
-           ^^^^^^^^^^^^^^^^^^^^^^^
- Alert deprecated: Toploop.directive_table
- 
- File "topfind.ml", line 319, characters 4-27:
- 319 |     Toploop.directive_table
-           ^^^^^^^^^^^^^^^^^^^^^^^
- Alert deprecated: Toploop.directive_table
- 
- File "_none_", line 1:
- Warning 58 [no-cmx-file]: no cmx file was found in path for module Topdirs, and its interface was not compiled with -opaque
- 
- File "_none_", line 1:
- Warning 58 [no-cmx-file]: no cmx file was found in path for module Toploop, and its interface was not compiled with -opaque
- ocamlopt -I +compiler-libs -g -a -o findlib_top.cmxa topfind.cmx
- if [ 1 -gt 0 ]; then \
-     ocamlopt -I +compiler-libs -g -shared -o findlib_top.cmxs topfind.cmx; \
- fi
- ocamlopt -I +compiler-libs -g -opaque  -I +unix -I +dynlink -c fl_dynload.ml
- ocamlopt -I +compiler-libs -g -a -o findlib_dynload.cmxa fl_dynload.cmx
- if [ 1 -gt 0 ]; then \
-     ocamlopt -I +compiler-libs -g -shared -o findlib_dynload.cmxs fl_dynload.cmx; \
- fi
- make[1]: Leaving directory '/home/opam/.opam/5.2.0+flambda2/.opam-switch/build/ocamlfind.1.9.8/src/findlib'
-> compiled  ocamlfind.1.9.8
Processing 18/41: [dune: ocaml 71] [ocamlbuild: make check-if-preinstalled]
Processing 19/41: [dune: ocaml 71] [ocamlbuild: make check-if-preinstalled] [ocamlfind: make install]
+ /home/opam/.opam/opam-init/hooks/sandbox.sh "install" "make" "install" (CWD=/home/opam/.opam/5.2.0+flambda2/.opam-switch/build/ocamlfind.1.9.8)
- if [ "0" -eq 1 ]; then \
-     for x in camlp4 dbm graphics labltk num ocamlbuild; do \
-       if [ -f "/home/opam/.opam/5.2.0+flambda2/lib/$x/META" ]; then \
-         if ! grep -Fq '[distributed with Ocaml]' "//home/opam/.opam/5.2.0+flambda2/lib/$x/META"; then \
-           rm -f site-lib-src/$x/META; \
-         fi; \
-       fi; \
-     done; \
-     test -f "site-lib-src/num/META" || rm -f "site-lib-src/num-top/META"; \
-   fi
- echo 'SITELIB_META =' > Makefile.packages.in
- for x in `ls site-lib-src`; do test ! -f "site-lib-src/$x/META" || echo $x >> Makefile.packages.in; done
- tr '\n' ' ' < Makefile.packages.in > Makefile.packages
- rm Makefile.packages.in
- install -d "/home/opam/.opam/5.2.0+flambda2/bin"
- install -d "/home/opam/.opam/5.2.0+flambda2/man"
- make install-config
- make[1]: Entering directory '/home/opam/.opam/5.2.0+flambda2/.opam-switch/build/ocamlfind.1.9.8'
- install -d "`dirname \"/home/opam/.opam/5.2.0+flambda2/lib/findlib.conf\"`"
- test -f "/home/opam/.opam/5.2.0+flambda2/lib/findlib.conf" || cp findlib.conf "/home/opam/.opam/5.2.0+flambda2/lib/findlib.conf"
- make[1]: Leaving directory '/home/opam/.opam/5.2.0+flambda2/.opam-switch/build/ocamlfind.1.9.8'
- for p in findlib; do ( cd src/$p; make install ); done
- make[1]: Entering directory '/home/opam/.opam/5.2.0+flambda2/.opam-switch/build/ocamlfind.1.9.8/src/findlib'
- install -d "/home/opam/.opam/5.2.0+flambda2/lib/findlib"
- install -d "/home/opam/.opam/5.2.0+flambda2/bin"
- test 1 -eq 0 || install -d "/home/opam/.opam/5.2.0+flambda2/lib/ocaml"
- test 1 -eq 0 || cp topfind "/home/opam/.opam/5.2.0+flambda2/lib/ocaml/"
- files=` ../../tools/collect_files ../../Makefile.config \
- findlib.cmi findlib.mli findlib.cma findlib.cmxa findlib.a findlib.cmxs \
- findlib_config.cmi findlib_config.ml topfind.cmi topfind.mli \
- fl_args.cmi fl_lint.cmi fl_meta.cmi fl_split.cmi fl_topo.cmi ocaml_args.cmi \
- fl_package_base.mli fl_package_base.cmi fl_metascanner.mli fl_metascanner.cmi \
- fl_metatoken.cmi findlib_top.cma findlib_top.cmxa findlib_top.a findlib_top.cmxs \
- findlib_dynload.cma findlib_dynload.cmxa findlib_dynload.a findlib_dynload.cmxs fl_dynload.mli fl_dynload.cmi \
- META` && \
- cp $files "/home/opam/.opam/5.2.0+flambda2/lib/findlib/"
- f="ocamlfind"; { test -f ocamlfind_opt && f="ocamlfind_opt"; }; \
- install -c $f "/home/opam/.opam/5.2.0+flambda2/bin/ocamlfind"
- # the following "if" block is only needed for 4.00beta2
- if [ 1 -eq 0 -a -f "/home/opam/.opam/5.2.0+flambda2/lib/ocaml/compiler-libs/topdirs.cmi" ]; then \
-     cd "/home/opam/.opam/5.2.0+flambda2/lib/ocaml/compiler-libs/"; \
-     cp topdirs.cmi toploop.cmi "/home/opam/.opam/5.2.0+flambda2/lib/findlib/"; \
- fi
- make[1]: Leaving directory '/home/opam/.opam/5.2.0+flambda2/.opam-switch/build/ocamlfind.1.9.8/src/findlib'
- make install-meta
- make[1]: Entering directory '/home/opam/.opam/5.2.0+flambda2/.opam-switch/build/ocamlfind.1.9.8'
- for x in bytes ; do install -d "/home/opam/.opam/5.2.0+flambda2/lib/$x"; cp site-lib-src/$x/META "/home/opam/.opam/5.2.0+flambda2/lib/$x/META.tmp" && mv "/home/opam/.opam/5.2.0+flambda2/lib/$x/META.tmp" "/home/opam/.opam/5.2.0+flambda2/lib/$x/META"; done
- install -d "/home/opam/.opam/5.2.0+flambda2/lib/findlib"; cp Makefile.packages "/home/opam/.opam/5.2.0+flambda2/lib/findlib/Makefile.packages"
- make[1]: Leaving directory '/home/opam/.opam/5.2.0+flambda2/.opam-switch/build/ocamlfind.1.9.8'
- test ! -f 'site-lib-src/num-top/META' || { cd src/findlib; make install-num-top; }
- test ! -f 'site-lib-src/camlp4/META' ||	install -c tools/safe_camlp4 "/home/opam/.opam/5.2.0+flambda2/bin"
- make install-doc
- make[1]: Entering directory '/home/opam/.opam/5.2.0+flambda2/.opam-switch/build/ocamlfind.1.9.8'
- install -d "/home/opam/.opam/5.2.0+flambda2/man/man1" "/home/opam/.opam/5.2.0+flambda2/man/man3" "/home/opam/.opam/5.2.0+flambda2/man/man5"
- cp doc/ref-man/ocamlfind.1 "/home/opam/.opam/5.2.0+flambda2/man/man1"
- cp: cannot stat 'doc/ref-man/ocamlfind.1': No such file or directory
- make[1]: [Makefile:91: install-doc] Error 1 (ignored)
- cp doc/ref-man/META.5 doc/ref-man/site-lib.5 doc/ref-man/findlib.conf.5 "/home/opam/.opam/5.2.0+flambda2/man/man5"
- cp: cannot stat 'doc/ref-man/META.5': No such file or directory
- cp: cannot stat 'doc/ref-man/site-lib.5': No such file or directory
- cp: cannot stat 'doc/ref-man/findlib.conf.5': No such file or directory
- make[1]: [Makefile:92: install-doc] Error 1 (ignored)
- make[1]: Leaving directory '/home/opam/.opam/5.2.0+flambda2/.opam-switch/build/ocamlfind.1.9.8'
-> installed ocamlfind.1.9.8
Processing 19/41: [dune: ocaml 71] [ocamlbuild: make check-if-preinstalled]
+ /home/opam/.opam/opam-init/hooks/sandbox.sh "build" "make" "check-if-preinstalled" "all" "opam-install" (CWD=/home/opam/.opam/5.2.0+flambda2/.opam-switch/build/ocamlbuild.0.15.0+ox)
- if test -d /home/opam/.opam/5.2.0+flambda2/lib/ocaml/ocamlbuild; then\
-   >&2 echo "ERROR: Preinstalled ocamlbuild detected at"\
-        "/home/opam/.opam/5.2.0+flambda2/lib/ocaml/ocamlbuild";\
-   >&2 echo "Installation aborted; if you want to bypass this"\
-         "safety check, pass CHECK_IF_PREINSTALLED=false to make";\
-   exit 2;\
- fi
- ocamlc.opt -for-pack Ocamlbuild_pack -w @14@29 -w +L -w +R -w +Z -I src -I plugin-lib -I bin -I +unix -safe-string -bin-annot -strict-sequence -c src/const.ml
- ocamlc.opt -for-pack Ocamlbuild_pack -w @14@29 -w +L -w +R -w +Z -I src -I plugin-lib -I bin -I +unix -safe-string -bin-annot -strict-sequence -c src/loc.mli
- ocamlc.opt -for-pack Ocamlbuild_pack -w @14@29 -w +L -w +R -w +Z -I src -I plugin-lib -I bin -I +unix -safe-string -bin-annot -strict-sequence -c src/loc.ml
- ocamlc.opt -for-pack Ocamlbuild_pack -w @14@29 -w +L -w +R -w +Z -I src -I plugin-lib -I bin -I +unix -safe-string -bin-annot -strict-sequence -c src/discard_printf.mli
- ocamlc.opt -for-pack Ocamlbuild_pack -w @14@29 -w +L -w +R -w +Z -I src -I plugin-lib -I bin -I +unix -safe-string -bin-annot -strict-sequence -c src/discard_printf.ml
- ocamlc.opt -for-pack Ocamlbuild_pack -w @14@29 -w +L -w +R -w +Z -I src -I plugin-lib -I bin -I +unix -safe-string -bin-annot -strict-sequence -c src/signatures.mli
- ocamlc.opt -for-pack Ocamlbuild_pack -w @14@29 -w +L -w +R -w +Z -I src -I plugin-lib -I bin -I +unix -safe-string -bin-annot -strict-sequence -c src/exit_codes.mli
- ocamlc.opt -for-pack Ocamlbuild_pack -w @14@29 -w +L -w +R -w +Z -I src -I plugin-lib -I bin -I +unix -safe-string -bin-annot -strict-sequence -c src/exit_codes.ml
- ocamlc.opt -for-pack Ocamlbuild_pack -w @14@29 -w +L -w +R -w +Z -I src -I plugin-lib -I bin -I +unix -safe-string -bin-annot -strict-sequence -c src/my_std.mli
- ocamlc.opt -for-pack Ocamlbuild_pack -w @14@29 -w +L -w +R -w +Z -I src -I plugin-lib -I bin -I +unix -safe-string -bin-annot -strict-sequence -c src/my_std.ml
- ocamlc.opt -for-pack Ocamlbuild_pack -w @14@29 -w +L -w +R -w +Z -I src -I plugin-lib -I bin -I +unix -safe-string -bin-annot -strict-sequence -c src/ocamlbuild_executor.mli
- ocamlc.opt -for-pack Ocamlbuild_pack -w @14@29 -w +L -w +R -w +Z -I src -I plugin-lib -I bin -I +unix -safe-string -bin-annot -strict-sequence -c src/ocamlbuild_executor.ml
- ocamlc.opt -for-pack Ocamlbuild_pack -w @14@29 -w +L -w +R -w +Z -I src -I plugin-lib -I bin -I +unix -safe-string -bin-annot -strict-sequence -c src/my_unix.mli
- ocamlc.opt -for-pack Ocamlbuild_pack -w @14@29 -w +L -w +R -w +Z -I src -I plugin-lib -I bin -I +unix -safe-string -bin-annot -strict-sequence -c src/my_unix.ml
- ocamlc.opt -for-pack Ocamlbuild_pack -w @14@29 -w +L -w +R -w +Z -I src -I plugin-lib -I bin -I +unix -safe-string -bin-annot -strict-sequence -c src/tags.mli
- ocamlc.opt -for-pack Ocamlbuild_pack -w @14@29 -w +L -w +R -w +Z -I src -I plugin-lib -I bin -I +unix -safe-string -bin-annot -strict-sequence -c src/tags.ml
- ocamlc.opt -for-pack Ocamlbuild_pack -w @14@29 -w +L -w +R -w +Z -I src -I plugin-lib -I bin -I +unix -safe-string -bin-annot -strict-sequence -c src/display.mli
- ocamlc.opt -for-pack Ocamlbuild_pack -w @14@29 -w +L -w +R -w +Z -I src -I plugin-lib -I bin -I +unix -safe-string -bin-annot -strict-sequence -c src/display.ml
- ocamlc.opt -for-pack Ocamlbuild_pack -w @14@29 -w +L -w +R -w +Z -I src -I plugin-lib -I bin -I +unix -safe-string -bin-annot -strict-sequence -c src/log.mli
- ocamlc.opt -for-pack Ocamlbuild_pack -w @14@29 -w +L -w +R -w +Z -I src -I plugin-lib -I bin -I +unix -safe-string -bin-annot -strict-sequence -c src/log.ml
- ocamlc.opt -for-pack Ocamlbuild_pack -w @14@29 -w +L -w +R -w +Z -I src -I plugin-lib -I bin -I +unix -safe-string -bin-annot -strict-sequence -c src/shell.mli
- ocamlc.opt -for-pack Ocamlbuild_pack -w @14@29 -w +L -w +R -w +Z -I src -I plugin-lib -I bin -I +unix -safe-string -bin-annot -strict-sequence -c src/shell.ml
- ocamlc.opt -for-pack Ocamlbuild_pack -w @14@29 -w +L -w +R -w +Z -I src -I plugin-lib -I bin -I +unix -safe-string -bin-annot -strict-sequence -c src/bool.mli
- ocamlc.opt -for-pack Ocamlbuild_pack -w @14@29 -w +L -w +R -w +Z -I src -I plugin-lib -I bin -I +unix -safe-string -bin-annot -strict-sequence -c src/bool.ml
- ocamlc.opt -for-pack Ocamlbuild_pack -w @14@29 -w +L -w +R -w +Z -I src -I plugin-lib -I bin -I +unix -safe-string -bin-annot -strict-sequence -c src/glob_ast.mli
- ocamlc.opt -for-pack Ocamlbuild_pack -w @14@29 -w +L -w +R -w +Z -I src -I plugin-lib -I bin -I +unix -safe-string -bin-annot -strict-sequence -c src/glob_ast.ml
- ocamllex.opt src/glob_lexer.mll
- 55 states, 419 transitions, table size 2006 bytes
- ocamlc.opt -for-pack Ocamlbuild_pack -w @14@29 -w +L -w +R -w +Z -I src -I plugin-lib -I bin -I +unix -safe-string -bin-annot -strict-sequence -c src/glob_lexer.mli
- ocamlc.opt -for-pack Ocamlbuild_pack -w @14@29 -w +L -w +R -w +Z -I src -I plugin-lib -I bin -I +unix -safe-string -bin-annot -strict-sequence -c src/glob_lexer.ml
- ocamlc.opt -for-pack Ocamlbuild_pack -w @14@29 -w +L -w +R -w +Z -I src -I plugin-lib -I bin -I +unix -safe-string -bin-annot -strict-sequence -c src/glob.mli
- ocamlc.opt -for-pack Ocamlbuild_pack -w @14@29 -w +L -w +R -w +Z -I src -I plugin-lib -I bin -I +unix -safe-string -bin-annot -strict-sequence -c src/glob.ml
- ocamllex.opt src/lexers.mll
- 235 states, 1033 transitions, table size 5542 bytes
- 4238 additional bytes used for bindings
- ocamlc.opt -for-pack Ocamlbuild_pack -w @14@29 -w +L -w +R -w +Z -I src -I plugin-lib -I bin -I +unix -safe-string -bin-annot -strict-sequence -c src/lexers.mli
- ocamlc.opt -for-pack Ocamlbuild_pack -w @14@29 -w +L -w +R -w +Z -I src -I plugin-lib -I bin -I +unix -safe-string -bin-annot -strict-sequence -c src/lexers.ml
- ocamlc.opt -for-pack Ocamlbuild_pack -w @14@29 -w +L -w +R -w +Z -I src -I plugin-lib -I bin -I +unix -safe-string -bin-annot -strict-sequence -c src/param_tags.mli
- ocamlc.opt -for-pack Ocamlbuild_pack -w @14@29 -w +L -w +R -w +Z -I src -I plugin-lib -I bin -I +unix -safe-string -bin-annot -strict-sequence -c src/param_tags.ml
- ocamlc.opt -for-pack Ocamlbuild_pack -w @14@29 -w +L -w +R -w +Z -I src -I plugin-lib -I bin -I +unix -safe-string -bin-annot -strict-sequence -c src/command.mli
- ocamlc.opt -for-pack Ocamlbuild_pack -w @14@29 -w +L -w +R -w +Z -I src -I plugin-lib -I bin -I +unix -safe-string -bin-annot -strict-sequence -c src/command.ml
- ocamlc.opt -for-pack Ocamlbuild_pack -w @14@29 -w +L -w +R -w +Z -I src -I plugin-lib -I bin -I +unix -safe-string -bin-annot -strict-sequence -c src/ocamlbuild_config.ml
- ocamlc.opt -for-pack Ocamlbuild_pack -w @14@29 -w +L -w +R -w +Z -I src -I plugin-lib -I bin -I +unix -safe-string -bin-annot -strict-sequence -c src/ocamlbuild_where.mli
- ocamlc.opt -for-pack Ocamlbuild_pack -w @14@29 -w +L -w +R -w +Z -I src -I plugin-lib -I bin -I +unix -safe-string -bin-annot -strict-sequence -c src/ocamlbuild_where.ml
- ocamlc.opt -for-pack Ocamlbuild_pack -w @14@29 -w +L -w +R -w +Z -I src -I plugin-lib -I bin -I +unix -safe-string -bin-annot -strict-sequence -c src/slurp.mli
- ocamlc.opt -for-pack Ocamlbuild_pack -w @14@29 -w +L -w +R -w +Z -I src -I plugin-lib -I bin -I +unix -safe-string -bin-annot -strict-sequence -c src/slurp.ml
- ocamlc.opt -for-pack Ocamlbuild_pack -w @14@29 -w +L -w +R -w +Z -I src -I plugin-lib -I bin -I +unix -safe-string -bin-annot -strict-sequence -c src/options.mli
- ocamlc.opt -for-pack Ocamlbuild_pack -w @14@29 -w +L -w +R -w +Z -I src -I plugin-lib -I bin -I +unix -safe-string -bin-annot -strict-sequence -c src/options.ml
- ocamlc.opt -for-pack Ocamlbuild_pack -w @14@29 -w +L -w +R -w +Z -I src -I plugin-lib -I bin -I +unix -safe-string -bin-annot -strict-sequence -c src/pathname.mli
- ocamlc.opt -for-pack Ocamlbuild_pack -w @14@29 -w +L -w +R -w +Z -I src -I plugin-lib -I bin -I +unix -safe-string -bin-annot -strict-sequence -c src/pathname.ml
- ocamlc.opt -for-pack Ocamlbuild_pack -w @14@29 -w +L -w +R -w +Z -I src -I plugin-lib -I bin -I +unix -safe-string -bin-annot -strict-sequence -c src/configuration.mli
- ocamlc.opt -for-pack Ocamlbuild_pack -w @14@29 -w +L -w +R -w +Z -I src -I plugin-lib -I bin -I +unix -safe-string -bin-annot -strict-sequence -c src/configuration.ml
- ocamlc.opt -for-pack Ocamlbuild_pack -w @14@29 -w +L -w +R -w +Z -I src -I plugin-lib -I bin -I +unix -safe-string -bin-annot -strict-sequence -c src/flags.mli
- ocamlc.opt -for-pack Ocamlbuild_pack -w @14@29 -w +L -w +R -w +Z -I src -I plugin-lib -I bin -I +unix -safe-string -bin-annot -strict-sequence -c src/flags.ml
- ocamlc.opt -for-pack Ocamlbuild_pack -w @14@29 -w +L -w +R -w +Z -I src -I plugin-lib -I bin -I +unix -safe-string -bin-annot -strict-sequence -c src/hygiene.mli
- ocamlc.opt -for-pack Ocamlbuild_pack -w @14@29 -w +L -w +R -w +Z -I src -I plugin-lib -I bin -I +unix -safe-string -bin-annot -strict-sequence -c src/hygiene.ml
- ocamlc.opt -for-pack Ocamlbuild_pack -w @14@29 -w +L -w +R -w +Z -I src -I plugin-lib -I bin -I +unix -safe-string -bin-annot -strict-sequence -c src/digest_cache.mli
- ocamlc.opt -for-pack Ocamlbuild_pack -w @14@29 -w +L -w +R -w +Z -I src -I plugin-lib -I bin -I +unix -safe-string -bin-annot -strict-sequence -c src/digest_cache.ml
- ocamlc.opt -for-pack Ocamlbuild_pack -w @14@29 -w +L -w +R -w +Z -I src -I plugin-lib -I bin -I +unix -safe-string -bin-annot -strict-sequence -c src/resource.mli
- ocamlc.opt -for-pack Ocamlbuild_pack -w @14@29 -w +L -w +R -w +Z -I src -I plugin-lib -I bin -I +unix -safe-string -bin-annot -strict-sequence -c src/resource.ml
- ocamlc.opt -for-pack Ocamlbuild_pack -w @14@29 -w +L -w +R -w +Z -I src -I plugin-lib -I bin -I +unix -safe-string -bin-annot -strict-sequence -c src/rule.mli
- ocamlc.opt -for-pack Ocamlbuild_pack -w @14@29 -w +L -w +R -w +Z -I src -I plugin-lib -I bin -I +unix -safe-string -bin-annot -strict-sequence -c src/rule.ml
- ocamlc.opt -for-pack Ocamlbuild_pack -w @14@29 -w +L -w +R -w +Z -I src -I plugin-lib -I bin -I +unix -safe-string -bin-annot -strict-sequence -c src/solver.mli
- ocamlc.opt -for-pack Ocamlbuild_pack -w @14@29 -w +L -w +R -w +Z -I src -I plugin-lib -I bin -I +unix -safe-string -bin-annot -strict-sequence -c src/solver.ml
- ocamlc.opt -for-pack Ocamlbuild_pack -w @14@29 -w +L -w +R -w +Z -I src -I plugin-lib -I bin -I +unix -safe-string -bin-annot -strict-sequence -c src/report.mli
- ocamlc.opt -for-pack Ocamlbuild_pack -w @14@29 -w +L -w +R -w +Z -I src -I plugin-lib -I bin -I +unix -safe-string -bin-annot -strict-sequence -c src/report.ml
- ocamlc.opt -for-pack Ocamlbuild_pack -w @14@29 -w +L -w +R -w +Z -I src -I plugin-lib -I bin -I +unix -safe-string -bin-annot -strict-sequence -c src/tools.mli
- ocamlc.opt -for-pack Ocamlbuild_pack -w @14@29 -w +L -w +R -w +Z -I src -I plugin-lib -I bin -I +unix -safe-string -bin-annot -strict-sequence -c src/tools.ml
- ocamlc.opt -for-pack Ocamlbuild_pack -w @14@29 -w +L -w +R -w +Z -I src -I plugin-lib -I bin -I +unix -safe-string -bin-annot -strict-sequence -c src/fda.mli
- ocamlc.opt -for-pack Ocamlbuild_pack -w @14@29 -w +L -w +R -w +Z -I src -I plugin-lib -I bin -I +unix -safe-string -bin-annot -strict-sequence -c src/fda.ml
- ocamlc.opt -for-pack Ocamlbuild_pack -w @14@29 -w +L -w +R -w +Z -I src -I plugin-lib -I bin -I +unix -safe-string -bin-annot -strict-sequence -c src/findlib.mli
- ocamlc.opt -for-pack Ocamlbuild_pack -w @14@29 -w +L -w +R -w +Z -I src -I plugin-lib -I bin -I +unix -safe-string -bin-annot -strict-sequence -c src/findlib.ml
- ocamlc.opt -for-pack Ocamlbuild_pack -w @14@29 -w +L -w +R -w +Z -I src -I plugin-lib -I bin -I +unix -safe-string -bin-annot -strict-sequence -c src/ocaml_arch.mli
- ocamlc.opt -for-pack Ocamlbuild_pack -w @14@29 -w +L -w +R -w +Z -I src -I plugin-lib -I bin -I +unix -safe-string -bin-annot -strict-sequence -c src/ocaml_arch.ml
- ocamlc.opt -for-pack Ocamlbuild_pack -w @14@29 -w +L -w +R -w +Z -I src -I plugin-lib -I bin -I +unix -safe-string -bin-annot -strict-sequence -c src/ocaml_utils.mli
- ocamlc.opt -for-pack Ocamlbuild_pack -w @14@29 -w +L -w +R -w +Z -I src -I plugin-lib -I bin -I +unix -safe-string -bin-annot -strict-sequence -c src/ocaml_utils.ml
- ocamlc.opt -for-pack Ocamlbuild_pack -w @14@29 -w +L -w +R -w +Z -I src -I plugin-lib -I bin -I +unix -safe-string -bin-annot -strict-sequence -c src/ocaml_dependencies.mli
- ocamlc.opt -for-pack Ocamlbuild_pack -w @14@29 -w +L -w +R -w +Z -I src -I plugin-lib -I bin -I +unix -safe-string -bin-annot -strict-sequence -c src/ocaml_dependencies.ml
- ocamlc.opt -for-pack Ocamlbuild_pack -w @14@29 -w +L -w +R -w +Z -I src -I plugin-lib -I bin -I +unix -safe-string -bin-annot -strict-sequence -c src/ocaml_compiler.mli
- ocamlc.opt -for-pack Ocamlbuild_pack -w @14@29 -w +L -w +R -w +Z -I src -I plugin-lib -I bin -I +unix -safe-string -bin-annot -strict-sequence -c src/ocaml_compiler.ml
- ocamlc.opt -for-pack Ocamlbuild_pack -w @14@29 -w +L -w +R -w +Z -I src -I plugin-lib -I bin -I +unix -safe-string -bin-annot -strict-sequence -c src/ocaml_tools.mli
- ocamlc.opt -for-pack Ocamlbuild_pack -w @14@29 -w +L -w +R -w +Z -I src -I plugin-lib -I bin -I +unix -safe-string -bin-annot -strict-sequence -c src/ocaml_tools.ml
- ocamlc.opt -for-pack Ocamlbuild_pack -w @14@29 -w +L -w +R -w +Z -I src -I plugin-lib -I bin -I +unix -safe-string -bin-annot -strict-sequence -c src/ocaml_specific.mli
- ocamlc.opt -for-pack Ocamlbuild_pack -w @14@29 -w +L -w +R -w +Z -I src -I plugin-lib -I bin -I +unix -safe-string -bin-annot -strict-sequence -c src/ocaml_specific.ml
- ocamlc.opt -for-pack Ocamlbuild_pack -w @14@29 -w +L -w +R -w +Z -I src -I plugin-lib -I bin -I +unix -safe-string -bin-annot -strict-sequence -c src/plugin.mli
- ocamlc.opt -for-pack Ocamlbuild_pack -w @14@29 -w +L -w +R -w +Z -I src -I plugin-lib -I bin -I +unix -safe-string -bin-annot -strict-sequence -c src/plugin.ml
- ocamlc.opt -for-pack Ocamlbuild_pack -w @14@29 -w +L -w +R -w +Z -I src -I plugin-lib -I bin -I +unix -safe-string -bin-annot -strict-sequence -c src/hooks.mli
- ocamlc.opt -for-pack Ocamlbuild_pack -w @14@29 -w +L -w +R -w +Z -I src -I plugin-lib -I bin -I +unix -safe-string -bin-annot -strict-sequence -c src/hooks.ml
- ocamlc.opt -for-pack Ocamlbuild_pack -w @14@29 -w +L -w +R -w +Z -I src -I plugin-lib -I bin -I +unix -safe-string -bin-annot -strict-sequence -c src/main.mli
- ocamlc.opt -for-pack Ocamlbuild_pack -w @14@29 -w +L -w +R -w +Z -I src -I plugin-lib -I bin -I +unix -safe-string -bin-annot -strict-sequence -c src/main.ml
- mkdir -p tmp
- ocamlc.opt -pack src/const.cmo src/loc.cmo src/discard_printf.cmo src/signatures.cmi src/exit_codes.cmo src/my_std.cmo src/ocamlbuild_executor.cmo src/my_unix.cmo src/tags.cmo src/display.cmo src/log.cmo src/shell.cmo src/bool.cmo src/glob_ast.cmo src/glob_lexer.cmo src/glob.cmo src/lexers.cmo src/param_tags.cmo src/command.cmo src/ocamlbuild_config.cmo src/ocamlbuild_where.cmo src/slurp.cmo src/options.cmo src/pathname.cmo src/configuration.cmo src/flags.cmo src/hygiene.cmo src/digest_cache.cmo src/resource.cmo src/rule.cmo src/solver.cmo src/report.cmo src/tools.cmo src/fda.cmo src/findlib.cmo src/ocaml_arch.cmo src/ocaml_utils.cmo src/ocaml_dependencies.cmo src/ocaml_compiler.cmo src/ocaml_tools.cmo src/ocaml_specific.cmo src/plugin.cmo src/hooks.cmo src/main.cmo -o tmp/ocamlbuild_pack.cmo
- mv tmp/ocamlbuild_pack.cmi src/ocamlbuild_pack.cmi
- mv tmp/ocamlbuild_pack.cmo src/ocamlbuild_pack.cmo
- ocamlc.opt -w @14@29 -w +L -w +R -w +Z -I src -I plugin-lib -I bin -I +unix -safe-string -bin-annot -strict-sequence -c plugin-lib/ocamlbuild_plugin.mli
- ocamlc.opt -w @14@29 -w +L -w +R -w +Z -I src -I plugin-lib -I bin -I +unix -safe-string -bin-annot -strict-sequence -c plugin-lib/ocamlbuild_plugin.ml
- ocamlc.opt -w @14@29 -w +L -w +R -w +Z -I src -I plugin-lib -I bin -I +unix -safe-string -bin-annot -strict-sequence -c plugin-lib/ocamlbuild_unix_plugin.ml
- ocamlc.opt -w @14@29 -w +L -w +R -w +Z -I src -I plugin-lib -I bin -I +unix -safe-string -bin-annot -strict-sequence -c bin/ocamlbuild.mli
- ocamlc.opt -w @14@29 -w +L -w +R -w +Z -I src -I plugin-lib -I bin -I +unix -safe-string -bin-annot -strict-sequence -c bin/ocamlbuild.ml
- ocamlc.opt -I +unix -I src -o ocamlbuild.byte -I +unix unix.cma src/ocamlbuild_pack.cmo plugin-lib/ocamlbuild_plugin.cmo plugin-lib/ocamlbuild_unix_plugin.cmo bin/ocamlbuild.cmo
- ocamlc.opt -a -o plugin-lib/ocamlbuildlib.cma src/ocamlbuild_pack.cmo plugin-lib/ocamlbuild_plugin.cmo plugin-lib/ocamlbuild_unix_plugin.cmo
- ocamlopt.opt -for-pack Ocamlbuild_pack -w @14@29 -w +L -w +R -w +Z -I src -I plugin-lib -I bin -I +unix -safe-string -bin-annot -strict-sequence -c src/const.ml
- ocamlopt.opt -for-pack Ocamlbuild_pack -w @14@29 -w +L -w +R -w +Z -I src -I plugin-lib -I bin -I +unix -safe-string -bin-annot -strict-sequence -c src/loc.ml
- ocamlopt.opt -for-pack Ocamlbuild_pack -w @14@29 -w +L -w +R -w +Z -I src -I plugin-lib -I bin -I +unix -safe-string -bin-annot -strict-sequence -c src/discard_printf.ml
- ocamlopt.opt -for-pack Ocamlbuild_pack -w @14@29 -w +L -w +R -w +Z -I src -I plugin-lib -I bin -I +unix -safe-string -bin-annot -strict-sequence -c src/exit_codes.ml
- ocamlopt.opt -for-pack Ocamlbuild_pack -w @14@29 -w +L -w +R -w +Z -I src -I plugin-lib -I bin -I +unix -safe-string -bin-annot -strict-sequence -c src/my_std.ml
- ocamlopt.opt -for-pack Ocamlbuild_pack -w @14@29 -w +L -w +R -w +Z -I src -I plugin-lib -I bin -I +unix -safe-string -bin-annot -strict-sequence -c src/ocamlbuild_executor.ml
- ocamlopt.opt -for-pack Ocamlbuild_pack -w @14@29 -w +L -w +R -w +Z -I src -I plugin-lib -I bin -I +unix -safe-string -bin-annot -strict-sequence -c src/my_unix.ml
- ocamlopt.opt -for-pack Ocamlbuild_pack -w @14@29 -w +L -w +R -w +Z -I src -I plugin-lib -I bin -I +unix -safe-string -bin-annot -strict-sequence -c src/tags.ml
- ocamlopt.opt -for-pack Ocamlbuild_pack -w @14@29 -w +L -w +R -w +Z -I src -I plugin-lib -I bin -I +unix -safe-string -bin-annot -strict-sequence -c src/display.ml
- ocamlopt.opt -for-pack Ocamlbuild_pack -w @14@29 -w +L -w +R -w +Z -I src -I plugin-lib -I bin -I +unix -safe-string -bin-annot -strict-sequence -c src/log.ml
- ocamlopt.opt -for-pack Ocamlbuild_pack -w @14@29 -w +L -w +R -w +Z -I src -I plugin-lib -I bin -I +unix -safe-string -bin-annot -strict-sequence -c src/shell.ml
- ocamlopt.opt -for-pack Ocamlbuild_pack -w @14@29 -w +L -w +R -w +Z -I src -I plugin-lib -I bin -I +unix -safe-string -bin-annot -strict-sequence -c src/bool.ml
- ocamlopt.opt -for-pack Ocamlbuild_pack -w @14@29 -w +L -w +R -w +Z -I src -I plugin-lib -I bin -I +unix -safe-string -bin-annot -strict-sequence -c src/glob_ast.ml
- ocamlopt.opt -for-pack Ocamlbuild_pack -w @14@29 -w +L -w +R -w +Z -I src -I plugin-lib -I bin -I +unix -safe-string -bin-annot -strict-sequence -c src/glob_lexer.ml
- ocamlopt.opt -for-pack Ocamlbuild_pack -w @14@29 -w +L -w +R -w +Z -I src -I plugin-lib -I bin -I +unix -safe-string -bin-annot -strict-sequence -c src/glob.ml
- ocamlopt.opt -for-pack Ocamlbuild_pack -w @14@29 -w +L -w +R -w +Z -I src -I plugin-lib -I bin -I +unix -safe-string -bin-annot -strict-sequence -c src/lexers.ml
- ocamlopt.opt -for-pack Ocamlbuild_pack -w @14@29 -w +L -w +R -w +Z -I src -I plugin-lib -I bin -I +unix -safe-string -bin-annot -strict-sequence -c src/param_tags.ml
- ocamlopt.opt -for-pack Ocamlbuild_pack -w @14@29 -w +L -w +R -w +Z -I src -I plugin-lib -I bin -I +unix -safe-string -bin-annot -strict-sequence -c src/command.ml
- ocamlopt.opt -for-pack Ocamlbuild_pack -w @14@29 -w +L -w +R -w +Z -I src -I plugin-lib -I bin -I +unix -safe-string -bin-annot -strict-sequence -c src/ocamlbuild_config.ml
- ocamlopt.opt -for-pack Ocamlbuild_pack -w @14@29 -w +L -w +R -w +Z -I src -I plugin-lib -I bin -I +unix -safe-string -bin-annot -strict-sequence -c src/ocamlbuild_where.ml
- ocamlopt.opt -for-pack Ocamlbuild_pack -w @14@29 -w +L -w +R -w +Z -I src -I plugin-lib -I bin -I +unix -safe-string -bin-annot -strict-sequence -c src/slurp.ml
- ocamlopt.opt -for-pack Ocamlbuild_pack -w @14@29 -w +L -w +R -w +Z -I src -I plugin-lib -I bin -I +unix -safe-string -bin-annot -strict-sequence -c src/options.ml
- ocamlopt.opt -for-pack Ocamlbuild_pack -w @14@29 -w +L -w +R -w +Z -I src -I plugin-lib -I bin -I +unix -safe-string -bin-annot -strict-sequence -c src/pathname.ml
- ocamlopt.opt -for-pack Ocamlbuild_pack -w @14@29 -w +L -w +R -w +Z -I src -I plugin-lib -I bin -I +unix -safe-string -bin-annot -strict-sequence -c src/configuration.ml
- ocamlopt.opt -for-pack Ocamlbuild_pack -w @14@29 -w +L -w +R -w +Z -I src -I plugin-lib -I bin -I +unix -safe-string -bin-annot -strict-sequence -c src/flags.ml
- ocamlopt.opt -for-pack Ocamlbuild_pack -w @14@29 -w +L -w +R -w +Z -I src -I plugin-lib -I bin -I +unix -safe-string -bin-annot -strict-sequence -c src/hygiene.ml
- ocamlopt.opt -for-pack Ocamlbuild_pack -w @14@29 -w +L -w +R -w +Z -I src -I plugin-lib -I bin -I +unix -safe-string -bin-annot -strict-sequence -c src/digest_cache.ml
- ocamlopt.opt -for-pack Ocamlbuild_pack -w @14@29 -w +L -w +R -w +Z -I src -I plugin-lib -I bin -I +unix -safe-string -bin-annot -strict-sequence -c src/resource.ml
- ocamlopt.opt -for-pack Ocamlbuild_pack -w @14@29 -w +L -w +R -w +Z -I src -I plugin-lib -I bin -I +unix -safe-string -bin-annot -strict-sequence -c src/rule.ml
- ocamlopt.opt -for-pack Ocamlbuild_pack -w @14@29 -w +L -w +R -w +Z -I src -I plugin-lib -I bin -I +unix -safe-string -bin-annot -strict-sequence -c src/solver.ml
- ocamlopt.opt -for-pack Ocamlbuild_pack -w @14@29 -w +L -w +R -w +Z -I src -I plugin-lib -I bin -I +unix -safe-string -bin-annot -strict-sequence -c src/report.ml
- ocamlopt.opt -for-pack Ocamlbuild_pack -w @14@29 -w +L -w +R -w +Z -I src -I plugin-lib -I bin -I +unix -safe-string -bin-annot -strict-sequence -c src/tools.ml
- ocamlopt.opt -for-pack Ocamlbuild_pack -w @14@29 -w +L -w +R -w +Z -I src -I plugin-lib -I bin -I +unix -safe-string -bin-annot -strict-sequence -c src/fda.ml
- ocamlopt.opt -for-pack Ocamlbuild_pack -w @14@29 -w +L -w +R -w +Z -I src -I plugin-lib -I bin -I +unix -safe-string -bin-annot -strict-sequence -c src/findlib.ml
- ocamlopt.opt -for-pack Ocamlbuild_pack -w @14@29 -w +L -w +R -w +Z -I src -I plugin-lib -I bin -I +unix -safe-string -bin-annot -strict-sequence -c src/ocaml_arch.ml
- ocamlopt.opt -for-pack Ocamlbuild_pack -w @14@29 -w +L -w +R -w +Z -I src -I plugin-lib -I bin -I +unix -safe-string -bin-annot -strict-sequence -c src/ocaml_utils.ml
- ocamlopt.opt -for-pack Ocamlbuild_pack -w @14@29 -w +L -w +R -w +Z -I src -I plugin-lib -I bin -I +unix -safe-string -bin-annot -strict-sequence -c src/ocaml_dependencies.ml
- ocamlopt.opt -for-pack Ocamlbuild_pack -w @14@29 -w +L -w +R -w +Z -I src -I plugin-lib -I bin -I +unix -safe-string -bin-annot -strict-sequence -c src/ocaml_compiler.ml
- ocamlopt.opt -for-pack Ocamlbuild_pack -w @14@29 -w +L -w +R -w +Z -I src -I plugin-lib -I bin -I +unix -safe-string -bin-annot -strict-sequence -c src/ocaml_tools.ml
- ocamlopt.opt -for-pack Ocamlbuild_pack -w @14@29 -w +L -w +R -w +Z -I src -I plugin-lib -I bin -I +unix -safe-string -bin-annot -strict-sequence -c src/ocaml_specific.ml
- ocamlopt.opt -for-pack Ocamlbuild_pack -w @14@29 -w +L -w +R -w +Z -I src -I plugin-lib -I bin -I +unix -safe-string -bin-annot -strict-sequence -c src/plugin.ml
- ocamlopt.opt -for-pack Ocamlbuild_pack -w @14@29 -w +L -w +R -w +Z -I src -I plugin-lib -I bin -I +unix -safe-string -bin-annot -strict-sequence -c src/hooks.ml
- ocamlopt.opt -for-pack Ocamlbuild_pack -w @14@29 -w +L -w +R -w +Z -I src -I plugin-lib -I bin -I +unix -safe-string -bin-annot -strict-sequence -c src/main.ml
- mkdir -p tmp
- ocamlopt.opt -pack src/const.cmx src/loc.cmx src/discard_printf.cmx src/signatures.cmi src/exit_codes.cmx src/my_std.cmx src/ocamlbuild_executor.cmx src/my_unix.cmx src/tags.cmx src/display.cmx src/log.cmx src/shell.cmx src/bool.cmx src/glob_ast.cmx src/glob_lexer.cmx src/glob.cmx src/lexers.cmx src/param_tags.cmx src/command.cmx src/ocamlbuild_config.cmx src/ocamlbuild_where.cmx src/slurp.cmx src/options.cmx src/pathname.cmx src/configuration.cmx src/flags.cmx src/hygiene.cmx src/digest_cache.cmx src/resource.cmx src/rule.cmx src/solver.cmx src/report.cmx src/tools.cmx src/fda.cmx src/findlib.cmx src/ocaml_arch.cmx src/ocaml_utils.cmx src/ocaml_dependencies.cmx src/ocaml_compiler.cmx src/ocaml_tools.cmx src/ocaml_specific.cmx src/plugin.cmx src/hooks.cmx src/main.cmx -o tmp/ocamlbuild_pack.cmx
- mv tmp/ocamlbuild_pack.cmx src/ocamlbuild_pack.cmx
- mv tmp/ocamlbuild_pack.o src/ocamlbuild_pack.o
- ocamlopt.opt -w @14@29 -w +L -w +R -w +Z -I src -I plugin-lib -I bin -I +unix -safe-string -bin-annot -strict-sequence -c plugin-lib/ocamlbuild_plugin.ml
- ocamlopt.opt -w @14@29 -w +L -w +R -w +Z -I src -I plugin-lib -I bin -I +unix -safe-string -bin-annot -strict-sequence -c plugin-lib/ocamlbuild_unix_plugin.ml
- ocamlopt.opt -w @14@29 -w +L -w +R -w +Z -I src -I plugin-lib -I bin -I +unix -safe-string -bin-annot -strict-sequence -c bin/ocamlbuild.ml
- ocamlopt.opt -I +unix -I src -o ocamlbuild.native -I +unix unix.cmxa src/ocamlbuild_pack.cmx plugin-lib/ocamlbuild_plugin.cmx plugin-lib/ocamlbuild_unix_plugin.cmx bin/ocamlbuild.cmx
- ocamlopt.opt -a -o plugin-lib/ocamlbuildlib.cmxa src/ocamlbuild_pack.cmx plugin-lib/ocamlbuild_plugin.cmx plugin-lib/ocamlbuild_unix_plugin.cmx
- ocamlc.opt -I +unix unix.cma src/ocamlbuild_pack.cmo -I src man/options_man.ml -o man/options_man.byte
- ./man/options_man.byte > man/ocamlbuild.options.1
- cat man/ocamlbuild.header.1 man/ocamlbuild.options.1 man/ocamlbuild.footer.1 > man/ocamlbuild.1
- make ocamlbuild.install
- make[1]: Entering directory '/home/opam/.opam/5.2.0+flambda2/.opam-switch/build/ocamlbuild.0.15.0+ox'
- rm -f ocamlbuild.install
- touch ocamlbuild.install
- make install-bin-opam
- make[2]: Entering directory '/home/opam/.opam/5.2.0+flambda2/.opam-switch/build/ocamlbuild.0.15.0+ox'
- echo 'bin: [' >> ocamlbuild.install
- echo '  "ocamlbuild.byte" {"ocamlbuild.byte"}' >> ocamlbuild.install
- echo '  "ocamlbuild.native" {"ocamlbuild.native"}' >> ocamlbuild.install
- echo '  "ocamlbuild.native" {"ocamlbuild"}' >> ocamlbuild.install
- echo ']' >> ocamlbuild.install
- echo >> ocamlbuild.install
- make[2]: Leaving directory '/home/opam/.opam/5.2.0+flambda2/.opam-switch/build/ocamlbuild.0.15.0+ox'
- make install-lib-opam
- make[2]: Entering directory '/home/opam/.opam/5.2.0+flambda2/.opam-switch/build/ocamlbuild.0.15.0+ox'
- echo 'lib: [' >> ocamlbuild.install
- make install-lib-basics-opam
- make[3]: Entering directory '/home/opam/.opam/5.2.0+flambda2/.opam-switch/build/ocamlbuild.0.15.0+ox'
- echo '  "ocamlbuild.opam" {"opam"}' >> ocamlbuild.install
- echo '  "META"' >> ocamlbuild.install
- for lib in src/signatures.mli src/signatures.cmi src/signatures.cmti; do \
-   echo "  \"$lib\" {\"$(basename $lib)\"}" >> ocamlbuild.install; \
- done
- make[3]: Leaving directory '/home/opam/.opam/5.2.0+flambda2/.opam-switch/build/ocamlbuild.0.15.0+ox'
- make install-lib-byte-opam
- make[3]: Entering directory '/home/opam/.opam/5.2.0+flambda2/.opam-switch/build/ocamlbuild.0.15.0+ox'
- for lib in plugin-lib/ocamlbuildlib.cma bin/ocamlbuild.cmo src/ocamlbuild_pack.cmi plugin-lib/ocamlbuild_plugin.cmi plugin-lib/ocamlbuild_unix_plugin.cmi; do \
-   echo "  \"$lib\" {\"$(basename $lib)\"}" >> ocamlbuild.install; \
- done
- make[3]: Leaving directory '/home/opam/.opam/5.2.0+flambda2/.opam-switch/build/ocamlbuild.0.15.0+ox'
- make install-lib-native-opam
- make[3]: Entering directory '/home/opam/.opam/5.2.0+flambda2/.opam-switch/build/ocamlbuild.0.15.0+ox'
- for lib in plugin-lib/ocamlbuildlib.cmxa plugin-lib/ocamlbuildlib.a bin/ocamlbuild.cmx bin/ocamlbuild.o src/ocamlbuild_pack.cmx plugin-lib/ocamlbuild_plugin.cmx plugin-lib/ocamlbuild_unix_plugin.cmx plugin-lib/ocamlbuild_plugin.o plugin-lib/ocamlbuild_unix_plugin.o; do \
-   echo "  \"$lib\" {\"$(basename $lib)\"}" >> ocamlbuild.install; \
- done
- make[3]: Leaving directory '/home/opam/.opam/5.2.0+flambda2/.opam-switch/build/ocamlbuild.0.15.0+ox'
- echo ']' >> ocamlbuild.install
- echo >> ocamlbuild.install
- make[2]: Leaving directory '/home/opam/.opam/5.2.0+flambda2/.opam-switch/build/ocamlbuild.0.15.0+ox'
- make install-man-opam
- make[2]: Entering directory '/home/opam/.opam/5.2.0+flambda2/.opam-switch/build/ocamlbuild.0.15.0+ox'
- echo 'man: [' >> ocamlbuild.install
- echo '  "man/ocamlbuild.1" {"man1/ocamlbuild.1"}' >> ocamlbuild.install
- echo ']' >> ocamlbuild.install
- echo >> ocamlbuild.install
- make[2]: Leaving directory '/home/opam/.opam/5.2.0+flambda2/.opam-switch/build/ocamlbuild.0.15.0+ox'
- make install-doc-opam
- make[2]: Entering directory '/home/opam/.opam/5.2.0+flambda2/.opam-switch/build/ocamlbuild.0.15.0+ox'
- echo 'doc: [' >> ocamlbuild.install
- echo '  "LICENSE"' >> ocamlbuild.install
- echo '  "Changes"' >> ocamlbuild.install
- echo '  "Readme.md"' >> ocamlbuild.install
- echo ']' >> ocamlbuild.install
- make[2]: Leaving directory '/home/opam/.opam/5.2.0+flambda2/.opam-switch/build/ocamlbuild.0.15.0+ox'
- make[1]: Leaving directory '/home/opam/.opam/5.2.0+flambda2/.opam-switch/build/ocamlbuild.0.15.0+ox'
-> compiled  ocamlbuild.0.15.0+ox
Processing 19/41: [dune: ocaml 71]
-> installed ocamlbuild.0.15.0+ox
Processing 20/41: [dune: ocaml 71]
[topkg: patch] applying topkg_string.patch
Processing 21/41: [dune: ocaml 71] [topkg: ocaml build]
+ /home/opam/.opam/opam-init/hooks/sandbox.sh "build" "ocaml" "pkg/pkg.ml" "build" "--pkg-name" "topkg" "--dev-pkg" "false" (CWD=/home/opam/.opam/5.2.0+flambda2/.opam-switch/build/topkg.1.0.8+ox)
- + ocamlfind ocamldep -modules src/topkg.ml > src/topkg.ml.depends
- + ocamlfind ocamldep -modules src/topkg.mli > src/topkg.mli.depends
- + ocamlfind ocamlc -c -g -bin-annot -safe-string -I src -I src-bin -I src-care -I test -o src/topkg.cmi src/topkg.mli
- + ocamlfind ocamldep -modules src/topkg_build.ml > src/topkg_build.ml.depends
- + ocamlfind ocamldep -modules src/topkg_build.mli > src/topkg_build.mli.depends
- + ocamlfind ocamldep -modules src/topkg_cmd.mli > src/topkg_cmd.mli.depends
- + ocamlfind ocamldep -modules src/topkg_fpath.mli > src/topkg_fpath.mli.depends
- + ocamlfind ocamlc -c -g -bin-annot -safe-string -I src -I src-bin -I src-care -I test -o src/topkg_fpath.cmi src/topkg_fpath.mli
- + ocamlfind ocamldep -modules src/topkg_codec.mli > src/topkg_codec.mli.depends
- + ocamlfind ocamlc -c -g -bin-annot -safe-string -I src -I src-bin -I src-care -I test -o src/topkg_cmd.cmi src/topkg_cmd.mli
- + ocamlfind ocamldep -modules src/topkg_result.mli > src/topkg_result.mli.depends
- + ocamlfind ocamlc -c -g -bin-annot -safe-string -I src -I src-bin -I src-care -I test -o src/topkg_result.cmi src/topkg_result.mli
- + ocamlfind ocamldep -modules src/topkg_conf.mli > src/topkg_conf.mli.depends
- + ocamlfind ocamlc -c -g -bin-annot -safe-string -I src -I src-bin -I src-care -I test -o src/topkg_codec.cmi src/topkg_codec.mli
- + ocamlfind ocamlc -c -g -bin-annot -safe-string -I src -I src-bin -I src-care -I test -o src/topkg_conf.cmi src/topkg_conf.mli
- + ocamlfind ocamlc -c -g -bin-annot -safe-string -I src -I src-bin -I src-care -I test -o src/topkg_build.cmi src/topkg_build.mli
- + ocamlfind ocamldep -modules src/topkg_cmd.ml > src/topkg_cmd.ml.depends
- + ocamlfind ocamldep -modules src/topkg_fpath.ml > src/topkg_fpath.ml.depends
- + ocamlfind ocamldep -modules src/topkg_string.ml > src/topkg_string.ml.depends
- + ocamlfind ocamldep -modules src/topkg_string.mli > src/topkg_string.mli.depends
- + ocamlfind ocamlc -c -g -bin-annot -safe-string -I src -I src-bin -I src-care -I test -o src/topkg_string.cmi src/topkg_string.mli
- + ocamlfind ocamlopt -c -g -bin-annot -safe-string -I src -I src-bin -I src-care -I test -o src/topkg_string.cmx src/topkg_string.ml
- + ocamlfind ocamlopt -c -g -bin-annot -safe-string -I src -I src-bin -I src-care -I test -o src/topkg_fpath.cmx src/topkg_fpath.ml
- + ocamlfind ocamldep -modules src/topkg_codec.ml > src/topkg_codec.ml.depends
- + ocamlfind ocamlopt -c -g -bin-annot -safe-string -I src -I src-bin -I src-care -I test -o src/topkg_cmd.cmx src/topkg_cmd.ml
- + ocamlfind ocamldep -modules src/topkg_os.ml > src/topkg_os.ml.depends
- + ocamlfind ocamldep -modules src/topkg_os.mli > src/topkg_os.mli.depends
- + ocamlfind ocamlc -c -g -bin-annot -safe-string -I src -I src-bin -I src-care -I test -o src/topkg_os.cmi src/topkg_os.mli
- + ocamlfind ocamldep -modules src/topkg_log.ml > src/topkg_log.ml.depends
- + ocamlfind ocamldep -modules src/topkg_log.mli > src/topkg_log.mli.depends
- + ocamlfind ocamlc -c -g -bin-annot -safe-string -I src -I src-bin -I src-care -I test -o src/topkg_log.cmi src/topkg_log.mli
- + ocamlfind ocamldep -modules src/topkg_result.ml > src/topkg_result.ml.depends
- + ocamlfind ocamlopt -c -g -bin-annot -safe-string -I src -I src-bin -I src-care -I test -o src/topkg_result.cmx src/topkg_result.ml
- + ocamlfind ocamlopt -c -g -bin-annot -safe-string -I src -I src-bin -I src-care -I test -o src/topkg_log.cmx src/topkg_log.ml
- + ocamlfind ocamlopt -c -g -bin-annot -safe-string -I src -I src-bin -I src-care -I test -o src/topkg_os.cmx src/topkg_os.ml
- + ocamlfind ocamldep -modules src/topkg_conf.ml > src/topkg_conf.ml.depends
- + ocamlfind ocamlopt -c -g -bin-annot -safe-string -I src -I src-bin -I src-care -I test -o src/topkg_codec.cmx src/topkg_codec.ml
- + ocamlfind ocamldep -modules src/topkg_vcs.ml > src/topkg_vcs.ml.depends
- + ocamlfind ocamldep -modules src/topkg_vcs.mli > src/topkg_vcs.mli.depends
- + ocamlfind ocamlc -c -g -bin-annot -safe-string -I src -I src-bin -I src-care -I test -o src/topkg_vcs.cmi src/topkg_vcs.mli
- + ocamlfind ocamlopt -c -g -bin-annot -safe-string -I src -I src-bin -I src-care -I test -o src/topkg_vcs.cmx src/topkg_vcs.ml
- + ocamlfind ocamlopt -c -g -bin-annot -safe-string -I src -I src-bin -I src-care -I test -o src/topkg_conf.cmx src/topkg_conf.ml
- + ocamlfind ocamldep -modules src/topkg_distrib.ml > src/topkg_distrib.ml.depends
- + ocamlfind ocamldep -modules src/topkg_distrib.mli > src/topkg_distrib.mli.depends
- + ocamlfind ocamlc -c -g -bin-annot -safe-string -I src -I src-bin -I src-care -I test -o src/topkg_distrib.cmi src/topkg_distrib.mli
- + ocamlfind ocamldep -modules src/topkg_opam.ml > src/topkg_opam.ml.depends
- + ocamlfind ocamldep -modules src/topkg_opam.mli > src/topkg_opam.mli.depends
- + ocamlfind ocamlc -c -g -bin-annot -safe-string -I src -I src-bin -I src-care -I test -o src/topkg_opam.cmi src/topkg_opam.mli
- + ocamlfind ocamlopt -c -g -bin-annot -safe-string -I src -I src-bin -I src-care -I test -o src/topkg_opam.cmx src/topkg_opam.ml
- + ocamlfind ocamldep -modules src/topkg_fexts.ml > src/topkg_fexts.ml.depends
- + ocamlfind ocamldep -modules src/topkg_fexts.mli > src/topkg_fexts.mli.depends
- + ocamlfind ocamlc -c -g -bin-annot -safe-string -I src -I src-bin -I src-care -I test -o src/topkg_fexts.cmi src/topkg_fexts.mli
- + ocamlfind ocamldep -modules src/topkg_install.ml > src/topkg_install.ml.depends
- + ocamlfind ocamldep -modules src/topkg_install.mli > src/topkg_install.mli.depends
- + ocamlfind ocamldep -modules src/topkg_test.mli > src/topkg_test.mli.depends
- + ocamlfind ocamlc -c -g -bin-annot -safe-string -I src -I src-bin -I src-care -I test -o src/topkg_test.cmi src/topkg_test.mli
- + ocamlfind ocamlc -c -g -bin-annot -safe-string -I src -I src-bin -I src-care -I test -o src/topkg_install.cmi src/topkg_install.mli
- + ocamlfind ocamlopt -c -g -bin-annot -safe-string -I src -I src-bin -I src-care -I test -o src/topkg_fexts.cmx src/topkg_fexts.ml
- + ocamlfind ocamldep -modules src/topkg_test.ml > src/topkg_test.ml.depends
- + ocamlfind ocamlopt -c -g -bin-annot -safe-string -I src -I src-bin -I src-care -I test -o src/topkg_test.cmx src/topkg_test.ml
- + ocamlfind ocamldep -modules src/topkg_ipc.ml > src/topkg_ipc.ml.depends
- + ocamlfind ocamldep -modules src/topkg_ipc.mli > src/topkg_ipc.mli.depends
- + ocamlfind ocamldep -modules src/topkg_pkg.mli > src/topkg_pkg.mli.depends
- + ocamlfind ocamldep -modules src/topkg_publish.mli > src/topkg_publish.mli.depends
- + ocamlfind ocamlc -c -g -bin-annot -safe-string -I src -I src-bin -I src-care -I test -o src/topkg_publish.cmi src/topkg_publish.mli
- + ocamlfind ocamlc -c -g -bin-annot -safe-string -I src -I src-bin -I src-care -I test -o src/topkg_pkg.cmi src/topkg_pkg.mli
- + ocamlfind ocamlc -c -g -bin-annot -safe-string -I src -I src-bin -I src-care -I test -o src/topkg_ipc.cmi src/topkg_ipc.mli
- + ocamlfind ocamldep -modules src/topkg_pkg.ml > src/topkg_pkg.ml.depends
- + ocamlfind ocamlopt -c -g -bin-annot -safe-string -I src -I src-bin -I src-care -I test -o src/topkg_build.cmx src/topkg_build.ml
- + ocamlfind ocamlopt -c -g -bin-annot -safe-string -I src -I src-bin -I src-care -I test -o src/topkg_distrib.cmx src/topkg_distrib.ml
- + ocamlfind ocamlopt -c -g -bin-annot -safe-string -I src -I src-bin -I src-care -I test -o src/topkg_install.cmx src/topkg_install.ml
- + ocamlfind ocamldep -modules src/topkg_publish.ml > src/topkg_publish.ml.depends
- + ocamlfind ocamlopt -c -g -bin-annot -safe-string -I src -I src-bin -I src-care -I test -o src/topkg_publish.cmx src/topkg_publish.ml
- + ocamlfind ocamlopt -c -g -bin-annot -safe-string -I src -I src-bin -I src-care -I test -o src/topkg_pkg.cmx src/topkg_pkg.ml
- + ocamlfind ocamldep -modules src/topkg_main.ml > src/topkg_main.ml.depends
- + ocamlfind ocamldep -modules src/topkg_main.mli > src/topkg_main.mli.depends
- + ocamlfind ocamlc -c -g -bin-annot -safe-string -I src -I src-bin -I src-care -I test -o src/topkg_main.cmi src/topkg_main.mli
- + ocamlfind ocamlopt -c -g -bin-annot -safe-string -I src -I src-bin -I src-care -I test -o src/topkg_ipc.cmx src/topkg_ipc.ml
- + ocamlfind ocamlopt -c -g -bin-annot -safe-string -I src -I src-bin -I src-care -I test -o src/topkg_main.cmx src/topkg_main.ml
- + ocamlfind ocamlopt -c -g -bin-annot -safe-string -I src -I src-bin -I src-care -I test -o src/topkg.cmx src/topkg.ml
- + ocamlfind ocamlopt -a -I src src/topkg_string.cmx src/topkg_fpath.cmx src/topkg_cmd.cmx src/topkg_result.cmx src/topkg_log.cmx src/topkg_os.cmx src/topkg_codec.cmx src/topkg_vcs.cmx src/topkg_conf.cmx src/topkg_build.cmx src/topkg_opam.cmx src/topkg_distrib.cmx src/topkg_fexts.cmx src/topkg_test.cmx src/topkg_install.cmx src/topkg_publish.cmx src/topkg_pkg.cmx src/topkg_ipc.cmx src/topkg_main.cmx src/topkg.cmx -o src/topkg.cmxa
- + ocamlfind ocamlopt -shared -linkall -I src src/topkg.cmxa -o src/topkg.cmxs
- + ocamlfind ocamlc -c -g -bin-annot -safe-string -I src -I src-bin -I src-care -I test -o src/topkg.cmo src/topkg.ml
- + ocamlfind ocamlc -c -g -bin-annot -safe-string -I src -I src-bin -I src-care -I test -o src/topkg_build.cmo src/topkg_build.ml
- + ocamlfind ocamlc -c -g -bin-annot -safe-string -I src -I src-bin -I src-care -I test -o src/topkg_cmd.cmo src/topkg_cmd.ml
- + ocamlfind ocamlc -c -g -bin-annot -safe-string -I src -I src-bin -I src-care -I test -o src/topkg_codec.cmo src/topkg_codec.ml
- + ocamlfind ocamlc -c -g -bin-annot -safe-string -I src -I src-bin -I src-care -I test -o src/topkg_conf.cmo src/topkg_conf.ml
- + ocamlfind ocamlc -c -g -bin-annot -safe-string -I src -I src-bin -I src-care -I test -o src/topkg_distrib.cmo src/topkg_distrib.ml
- + ocamlfind ocamlc -c -g -bin-annot -safe-string -I src -I src-bin -I src-care -I test -o src/topkg_fexts.cmo src/topkg_fexts.ml
- + ocamlfind ocamlc -c -g -bin-annot -safe-string -I src -I src-bin -I src-care -I test -o src/topkg_fpath.cmo src/topkg_fpath.ml
- + ocamlfind ocamlc -c -g -bin-annot -safe-string -I src -I src-bin -I src-care -I test -o src/topkg_install.cmo src/topkg_install.ml
- + ocamlfind ocamlc -c -g -bin-annot -safe-string -I src -I src-bin -I src-care -I test -o src/topkg_ipc.cmo src/topkg_ipc.ml
- + ocamlfind ocamlc -c -g -bin-annot -safe-string -I src -I src-bin -I src-care -I test -o src/topkg_log.cmo src/topkg_log.ml
- + ocamlfind ocamlc -c -g -bin-annot -safe-string -I src -I src-bin -I src-care -I test -o src/topkg_main.cmo src/topkg_main.ml
- + ocamlfind ocamlc -c -g -bin-annot -safe-string -I src -I src-bin -I src-care -I test -o src/topkg_opam.cmo src/topkg_opam.ml
- + ocamlfind ocamlc -c -g -bin-annot -safe-string -I src -I src-bin -I src-care -I test -o src/topkg_os.cmo src/topkg_os.ml
- + ocamlfind ocamlc -c -g -bin-annot -safe-string -I src -I src-bin -I src-care -I test -o src/topkg_pkg.cmo src/topkg_pkg.ml
- + ocamlfind ocamlc -c -g -bin-annot -safe-string -I src -I src-bin -I src-care -I test -o src/topkg_publish.cmo src/topkg_publish.ml
- + ocamlfind ocamlc -c -g -bin-annot -safe-string -I src -I src-bin -I src-care -I test -o src/topkg_result.cmo src/topkg_result.ml
- + ocamlfind ocamlc -c -g -bin-annot -safe-string -I src -I src-bin -I src-care -I test -o src/topkg_string.cmo src/topkg_string.ml
- + ocamlfind ocamlc -c -g -bin-annot -safe-string -I src -I src-bin -I src-care -I test -o src/topkg_test.cmo src/topkg_test.ml
- + ocamlfind ocamlc -c -g -bin-annot -safe-string -I src -I src-bin -I src-care -I test -o src/topkg_vcs.cmo src/topkg_vcs.ml
- + ocamlfind ocamlc -a -I src src/topkg_string.cmo src/topkg_fpath.cmo src/topkg_cmd.cmo src/topkg_result.cmo src/topkg_log.cmo src/topkg_os.cmo src/topkg_codec.cmo src/topkg_vcs.cmo src/topkg_conf.cmo src/topkg_build.cmo src/topkg_opam.cmo src/topkg_distrib.cmo src/topkg_fexts.cmo src/topkg_test.cmo src/topkg_install.cmo src/topkg_publish.cmo src/topkg_pkg.cmo src/topkg_ipc.cmo src/topkg_main.cmo src/topkg.cmo -o src/topkg.cma
- # Parallel statistics: { count(total): 2(84), max: 20, min: 2, average(total): 11.000(1.238) }
-> compiled  topkg.1.0.8+ox
Processing 21/41: [dune: ocaml 71]
-> installed topkg.1.0.8+ox
Processing 22/41: [dune: ocaml 71]
Processing 23/41: [astring: ocaml build] [dune: ocaml 71]
Processing 24/41: [astring: ocaml build] [dune: ocaml 71] [rresult: ocaml build]
+ /home/opam/.opam/opam-init/hooks/sandbox.sh "build" "ocaml" "pkg/pkg.ml" "build" "--dev-pkg" "false" (CWD=/home/opam/.opam/5.2.0+flambda2/.opam-switch/build/rresult.0.7.0)
- + ocamlfind ocamldep -modules src/rresult.ml > src/rresult.ml.depends
- + ocamlfind ocamldep -modules src/rresult.mli > src/rresult.mli.depends
- + ocamlfind ocamlc -c -g -bin-annot -safe-string -I src -I test -o src/rresult.cmi src/rresult.mli
- + ocamlfind ocamlopt -c -g -bin-annot -safe-string -I src -I test -o src/rresult.cmx src/rresult.ml
- + ocamlfind ocamlopt -a -I src src/rresult.cmx -o src/rresult.cmxa
- + ocamlfind ocamlopt -shared -linkall -I src src/rresult.cmxa -o src/rresult.cmxs
- + ocamlfind ocamlc -c -g -bin-annot -safe-string -I src -I test -o src/rresult.cmo src/rresult.ml
- + ocamlfind ocamlc -a -I src src/rresult.cmo -o src/rresult.cma
- + ocamlfind ocamldep -package compiler-libs.toplevel -modules src/rresult_top.ml > src/rresult_top.ml.depends
- + ocamlfind ocamlc -c -g -bin-annot -safe-string -package compiler-libs.toplevel -I src -I test -o src/rresult_top.cmo src/rresult_top.ml
- + ocamlfind ocamlc -c -g -bin-annot -safe-string -package compiler-libs.toplevel -I src -I test -o src/rresult_top.cmo src/rresult_top.ml
- findlib: [WARNING] Interface opttopdirs.cmi occurs in several directories: /home/opam/.opam/5.2.0+flambda2/lib/ocaml, /home/opam/.opam/5.2.0+flambda2/lib/ocaml/compiler-libs
- findlib: [WARNING] Interface topdirs.cmi occurs in several directories: /home/opam/.opam/5.2.0+flambda2/lib/ocaml, /home/opam/.opam/5.2.0+flambda2/lib/ocaml/compiler-libs
- + ocamlfind ocamlopt -c -g -bin-annot -safe-string -package compiler-libs.toplevel -I src -I test -o src/rresult_top.cmx src/rresult_top.ml
- + ocamlfind ocamlopt -c -g -bin-annot -safe-string -package compiler-libs.toplevel -I src -I test -o src/rresult_top.cmx src/rresult_top.ml
- findlib: [WARNING] Interface opttopdirs.cmi occurs in several directories: /home/opam/.opam/5.2.0+flambda2/lib/ocaml, /home/opam/.opam/5.2.0+flambda2/lib/ocaml/compiler-libs
- findlib: [WARNING] Interface topdirs.cmi occurs in several directories: /home/opam/.opam/5.2.0+flambda2/lib/ocaml, /home/opam/.opam/5.2.0+flambda2/lib/ocaml/compiler-libs
- File "_none_", line 1:
- Warning 58 [no-cmx-file]: no cmx file was found in path for module Toploop, and its interface was not compiled with -opaque
- + ocamlfind ocamlopt -a -package compiler-libs.toplevel -I src src/rresult_top.cmx -o src/rresult_top.cmxa
- + ocamlfind ocamlopt -a -package compiler-libs.toplevel -I src src/rresult_top.cmx -o src/rresult_top.cmxa
- findlib: [WARNING] Interface opttopdirs.cmi occurs in several directories: /home/opam/.opam/5.2.0+flambda2/lib/ocaml, /home/opam/.opam/5.2.0+flambda2/lib/ocaml/compiler-libs
- findlib: [WARNING] Interface topdirs.cmi occurs in several directories: /home/opam/.opam/5.2.0+flambda2/lib/ocaml, /home/opam/.opam/5.2.0+flambda2/lib/ocaml/compiler-libs
- + ocamlfind ocamlopt -shared -linkall -package compiler-libs.toplevel -I src src/rresult_top.cmxa -o src/rresult_top.cmxs
- + ocamlfind ocamlopt -shared -linkall -package compiler-libs.toplevel -I src src/rresult_top.cmxa -o src/rresult_top.cmxs
- findlib: [WARNING] Interface opttopdirs.cmi occurs in several directories: /home/opam/.opam/5.2.0+flambda2/lib/ocaml, /home/opam/.opam/5.2.0+flambda2/lib/ocaml/compiler-libs
- findlib: [WARNING] Interface topdirs.cmi occurs in several directories: /home/opam/.opam/5.2.0+flambda2/lib/ocaml, /home/opam/.opam/5.2.0+flambda2/lib/ocaml/compiler-libs
- + ocamlfind ocamlc -a -package compiler-libs.toplevel -I src src/rresult_top.cmo -o src/rresult_top.cma
- + ocamlfind ocamlc -a -package compiler-libs.toplevel -I src src/rresult_top.cmo -o src/rresult_top.cma
- findlib: [WARNING] Interface opttopdirs.cmi occurs in several directories: /home/opam/.opam/5.2.0+flambda2/lib/ocaml, /home/opam/.opam/5.2.0+flambda2/lib/ocaml/compiler-libs
- findlib: [WARNING] Interface topdirs.cmi occurs in several directories: /home/opam/.opam/5.2.0+flambda2/lib/ocaml, /home/opam/.opam/5.2.0+flambda2/lib/ocaml/compiler-libs
- # No parallelism done
-> compiled  rresult.0.7.0
Processing 24/41: [astring: ocaml build] [dune: ocaml 71]
-> installed rresult.0.7.0
Processing 25/41: [astring: ocaml build] [dune: ocaml 71]
+ /home/opam/.opam/opam-init/hooks/sandbox.sh "build" "ocaml" "boot/bootstrap.ml" "-j" "71" (CWD=/home/opam/.opam/5.2.0+flambda2/.opam-switch/build/dune.3.19.1)
- ocamlc -output-complete-exe -w -24 -g -o .duneboot.exe -I boot -I +unix unix.cma boot/libs.ml boot/duneboot.ml
- ./.duneboot.exe -j 71
- cd _boot && /home/opam/.opam/5.2.0+flambda2/bin/ocamlopt.opt -c -g -no-alias-deps -w -49-6 -alert -unstable -I +unix -I +threads ocamlc_loc.mli
- File "otherlibs/ocamlc-loc/src/ocamlc_loc.mli", line 1, characters 4-9:
- Warning 53 [misplaced-attribute]: the "alert" attribute cannot appear in this context
- cd _boot && /home/opam/.opam/5.2.0+flambda2/bin/ocamlopt.opt -c -g -no-alias-deps -w -49-6 -alert -unstable -I +unix -I +threads stdune__Code_error.ml
- File "otherlibs/stdune/src/code_error.ml", line 29, characters 2-27:
- Alert unsafe_multidomain: Stdlib.Printexc.register_printer
- Use [Printexc.Safe.register_printer].
- cd _boot && /home/opam/.opam/5.2.0+flambda2/bin/ocamlopt.opt -c -g -no-alias-deps -w -49-6 -alert -unstable -I +unix -I +threads notty_unix.ml
- File "vendor/notty/src-unix/notty_unix.ml", line 38, characters 23-29:
- Alert unsafe_multidomain: Stdlib.Sys.signal
- Use [Sys.Safe.signal].
- 
- File "vendor/notty/src-unix/notty_unix.ml", line 39, characters 31-45:
- Alert unsafe_multidomain: Stdlib.Sys.set_signal
- Use [Sys.Safe.set_signal].
- cd _boot && /home/opam/.opam/5.2.0+flambda2/bin/ocamlopt.opt -c -g -no-alias-deps -w -49-6 -alert -unstable -I +unix -I +threads stdune__User_error.ml
- File "otherlibs/stdune/src/user_error.ml", line 17, characters 2-27:
- Alert unsafe_multidomain: Stdlib.Printexc.register_printer
- Use [Printexc.Safe.register_printer].
- cd _boot && /home/opam/.opam/5.2.0+flambda2/bin/ocamlopt.opt -c -g -no-alias-deps -w -49-6 -alert -unstable -I +unix -I +threads opamStd.ml
- File "vendor/opam/src/core/opamStd.ml", line 960, characters 10-24:
- Alert unsafe_multidomain: Stdlib.Sys.set_signal
- Use [Sys.Safe.set_signal].
- cd _boot && /home/opam/.opam/5.2.0+flambda2/bin/ocamlopt.opt -c -g -no-alias-deps -w -49-6 -alert -unstable -I +unix -I +threads dune_rpc_private__Conv.ml
- File "otherlibs/dune-rpc/private/conv.ml", line 48, characters 2-27:
- Alert unsafe_multidomain: Stdlib.Printexc.register_printer
- Use [Printexc.Safe.register_printer].
- cd _boot && /home/opam/.opam/5.2.0+flambda2/bin/ocamlopt.opt -c -g -no-alias-deps -w -49-6 -alert -unstable -I +unix -I +threads dune_rpc_private__Where.ml
- File "otherlibs/dune-rpc/private/where.ml", line 22, characters 2-27:
- Alert unsafe_multidomain: Stdlib.Printexc.register_printer
- Use [Printexc.Safe.register_printer].
- cd _boot && /home/opam/.opam/5.2.0+flambda2/bin/ocamlopt.opt -c -g -no-alias-deps -w -49-6 -alert -unstable -I +unix -I +threads dune_rpc_private__Types.ml
- File "otherlibs/dune-rpc/private/types.ml", line 154, characters 6-31:
- Alert unsafe_multidomain: Stdlib.Printexc.register_printer
- Use [Printexc.Safe.register_printer].
- cd _boot && /home/opam/.opam/5.2.0+flambda2/bin/ocamlopt.opt -c -g -no-alias-deps -w -49-6 -alert -unstable -I +unix -I +threads dune_rpc_private__Registry.ml
- File "otherlibs/dune-rpc/private/registry.ml", line 67, characters 4-29:
- Alert unsafe_multidomain: Stdlib.Printexc.register_printer
- Use [Printexc.Safe.register_printer].
- cd _boot && /home/opam/.opam/5.2.0+flambda2/bin/ocamlopt.opt -c -g -no-alias-deps -w -49-6 -alert -unstable -I +unix -I +threads opamSystem.ml
- File "vendor/opam/src/core/opamSystem.ml", line 1248, characters 2-27:
- Alert unsafe_multidomain: Stdlib.Printexc.register_printer
- Use [Printexc.Safe.register_printer].
- 
- File "vendor/opam/src/core/opamSystem.ml", line 1264, characters 6-20:
- Alert unsafe_multidomain: Stdlib.Sys.set_signal
- Use [Sys.Safe.set_signal].
- cd _boot && /home/opam/.opam/5.2.0+flambda2/bin/ocamlopt.opt -c -g -no-alias-deps -w -49-6 -alert -unstable -I +unix -I +threads dune_rpc_private__Versioned.ml
- File "otherlibs/dune-rpc/private/versioned.ml", line 23, characters 4-29:
- Alert unsafe_multidomain: Stdlib.Printexc.register_printer
- Use [Printexc.Safe.register_printer].
- cd _boot && /home/opam/.opam/5.2.0+flambda2/bin/ocamlopt.opt -c -g -no-alias-deps -w -49-6 -alert -unstable -I +unix -I +threads memo.ml
- File "src/memo/memo.ml", line 414, characters 2-27:
- Alert unsafe_multidomain: Stdlib.Printexc.register_printer
- Use [Printexc.Safe.register_printer].
- cd _boot && /home/opam/.opam/5.2.0+flambda2/bin/ocamlopt.opt -c -g -no-alias-deps -w -49-6 -alert -unstable -I +unix -I +threads dune_rpc_private.ml
- File "otherlibs/dune-rpc/private/dune_rpc_private.ml", line 200, characters 6-31:
- Alert unsafe_multidomain: Stdlib.Printexc.register_printer
- Use [Printexc.Safe.register_printer].
- cd _boot && /home/opam/.opam/5.2.0+flambda2/bin/ocamlopt.opt -c -g -no-alias-deps -w -49-6 -alert -unstable -I +unix -I +threads dune_action_plugin.mli
- File "otherlibs/dune-action-plugin/src/dune_action_plugin.mli", line 1, characters 4-9:
- Warning 53 [misplaced-attribute]: the "alert" attribute cannot appear in this context
- cd _boot && /home/opam/.opam/5.2.0+flambda2/bin/ocamlopt.opt -c -g -no-alias-deps -w -49-6 -alert -unstable -I +unix -I +threads dune_rpc_server.ml
- File "src/dune_rpc_server/dune_rpc_server.ml", line 15, characters 2-27:
- Alert unsafe_multidomain: Stdlib.Printexc.register_printer
- Use [Printexc.Safe.register_printer].
- cd _boot && /home/opam/.opam/5.2.0+flambda2/bin/ocamlopt.opt -c -g -no-alias-deps -w -49-6 -alert -unstable -I +unix -I +threads dune_engine__Scheduler.ml
- File "src/dune_engine/scheduler.ml", line 54, characters 4-29:
- Alert unsafe_multidomain: Stdlib.Printexc.register_printer
- Use [Printexc.Safe.register_printer].
- 
- File "src/dune_engine/scheduler.ml", line 632, characters 6-20:
- Alert unsafe_multidomain: Dune_engine__.Import.Sys.set_signal
- Use [Sys.Safe.set_signal].
- cd _boot && /home/opam/.opam/5.2.0+flambda2/bin/ocamlopt.opt -c -g -no-alias-deps -w -49-6 -alert -unstable -I +unix -I +threads opamPp.ml
- File "vendor/opam/src/format/opamPp.ml", line 64, characters 9-34:
- Alert unsafe_multidomain: Stdlib.Printexc.register_printer
- Use [Printexc.Safe.register_printer].
- cd _boot && /home/opam/.opam/5.2.0+flambda2/bin/ocamlopt.opt -c -g -no-alias-deps -w -49-6 -alert -unstable -I +unix -I +threads dune_tui.ml
- File "src/dune_tui/dune_tui.ml", line 14, characters 7-21:
- Alert unsafe_multidomain: Dune_tui__.Import.Sys.set_signal
- Use [Sys.Safe.set_signal].
- 
- File "src/dune_tui/dune_tui.ml", line 22, characters 12-22:
- Alert unsafe_multidomain: Dune_tui__.Import.Sys.signal
- Use [Sys.Safe.signal].
- 

Processing 25/41: [astring: ocaml build] [dune: ./_boot/dune.exe build]
+ /home/opam/.opam/opam-init/hooks/sandbox.sh "build" "./_boot/dune.exe" "build" "dune.install" "--release" "--profile" "dune-bootstrap" "-j" "71" (CWD=/home/opam/.opam/5.2.0+flambda2/.opam-switch/build/dune.3.19.1)
-> compiled  dune.3.19.1
Processing 25/41: [astring: ocaml build]
-> installed dune.3.19.1
Processing 26/41: [astring: ocaml build]
Processing 27/41: [astring: ocaml build] [bigarray-compat: dune build]
Processing 28/41: [astring: ocaml build] [bigarray-compat: dune build] [csexp: dune build]
Processing 29/41: [astring: ocaml build] [bigarray-compat: dune build] [csexp: dune build] [stdlib-shims: dune build]
+ /home/opam/.opam/opam-init/hooks/sandbox.sh "build" "dune" "build" "-p" "csexp" "-j" "71" "@install" (CWD=/home/opam/.opam/5.2.0+flambda2/.opam-switch/build/csexp.1.5.2)
- (cd _build/default && /home/opam/.opam/5.2.0+flambda2/bin/ocamlc.opt -w -40 -g -bin-annot -bin-annot-occurrences -I src/.csexp.objs/byte -intf-suffix .ml -no-alias-deps -o src/.csexp.objs/byte/csexp.cmo -c -impl src/csexp.ml)
- File "src/csexp.ml", line 236, characters 7-14:
- 236 |     [@@inlined always]
-              ^^^^^^^
- Warning 53 [misplaced-attribute]: the "inlined" attribute cannot appear in this context
- (cd _build/default && /home/opam/.opam/5.2.0+flambda2/bin/ocamlopt.opt -w -40 -g -I src/.csexp.objs/byte -I src/.csexp.objs/native -intf-suffix .ml -no-alias-deps -o src/.csexp.objs/native/csexp.cmx -c -impl src/csexp.ml)
- File "src/csexp.ml", line 236, characters 7-14:
- 236 |     [@@inlined always]
-              ^^^^^^^
- Warning 53 [misplaced-attribute]: the "inlined" attribute cannot appear in this context
-> compiled  csexp.1.5.2
Processing 29/41: [astring: ocaml build] [bigarray-compat: dune build] [stdlib-shims: dune build]
-> installed csexp.1.5.2
Processing 30/41: [astring: ocaml build] [bigarray-compat: dune build] [stdlib-shims: dune build]
Processing 31/41: [astring: ocaml build] [bigarray-compat: dune build] [dune-configurator: rm] [stdlib-shims: dune build]
+ /home/opam/.opam/opam-init/hooks/sandbox.sh "build" "ocaml" "pkg/pkg.ml" "build" "--pinned" "false" (CWD=/home/opam/.opam/5.2.0+flambda2/.opam-switch/build/astring.0.8.5)
- + ocamlfind ocamldep -modules src/astring_unsafe.ml > src/astring_unsafe.ml.depends
- + ocamlfind ocamlc -c -g -bin-annot -safe-string -I src -I test -o src/astring_unsafe.cmo src/astring_unsafe.ml
- + ocamlfind ocamldep -modules src/astring_base.ml > src/astring_base.ml.depends
- + ocamlfind ocamlc -c -g -bin-annot -safe-string -I src -I test -o src/astring_base.cmo src/astring_base.ml
- + ocamlfind ocamlopt -c -g -bin-annot -safe-string -I src -I test -o src/astring_unsafe.cmx src/astring_unsafe.ml
- + ocamlfind ocamldep -modules src/astring_escape.ml > src/astring_escape.ml.depends
- + ocamlfind ocamlc -c -g -bin-annot -safe-string -I src -I test -o src/astring_escape.cmo src/astring_escape.ml
- + ocamlfind ocamldep -modules src/astring_char.ml > src/astring_char.ml.depends
- + ocamlfind ocamlc -c -g -bin-annot -safe-string -I src -I test -o src/astring_char.cmo src/astring_char.ml
- + ocamlfind ocamlopt -c -g -bin-annot -safe-string -I src -I test -o src/astring_escape.cmx src/astring_escape.ml
- + ocamlfind ocamldep -modules src/astring_sub.ml > src/astring_sub.ml.depends
- + ocamlfind ocamlc -c -g -bin-annot -safe-string -I src -I test -o src/astring_sub.cmo src/astring_sub.ml
- + ocamlfind ocamlopt -c -g -bin-annot -safe-string -I src -I test -o src/astring_base.cmx src/astring_base.ml
- + ocamlfind ocamlopt -c -g -bin-annot -safe-string -I src -I test -o src/astring_char.cmx src/astring_char.ml
- + ocamlfind ocamldep -modules src/astring_string.ml > src/astring_string.ml.depends
- + ocamlfind ocamlc -c -g -bin-annot -safe-string -I src -I test -o src/astring_string.cmo src/astring_string.ml
- + ocamlfind ocamlopt -c -g -bin-annot -safe-string -I src -I test -o src/astring_sub.cmx src/astring_sub.ml
- + ocamlfind ocamldep -modules src/astring.ml > src/astring.ml.depends
- + ocamlfind ocamldep -modules src/astring.mli > src/astring.mli.depends
- + ocamlfind ocamlc -c -g -bin-annot -safe-string -I src -I test -o src/astring.cmi src/astring.mli
- + ocamlfind ocamlopt -c -g -bin-annot -safe-string -I src -I test -o src/astring_string.cmx src/astring_string.ml
- + ocamlfind ocamlopt -c -g -bin-annot -safe-string -I src -I test -o src/astring.cmx src/astring.ml
- + ocamlfind ocamlopt -a -I src src/astring_unsafe.cmx src/astring_base.cmx src/astring_escape.cmx src/astring_char.cmx src/astring_sub.cmx src/astring_string.cmx src/astring.cmx -o src/astring.cmxa
- + ocamlfind ocamlopt -shared -linkall -I src src/astring.cmxa -o src/astring.cmxs
- + ocamlfind ocamlc -c -g -bin-annot -safe-string -I src -I test -o src/astring.cmo src/astring.ml
- + ocamlfind ocamlc -a -I src src/astring_unsafe.cmo src/astring_base.cmo src/astring_escape.cmo src/astring_char.cmo src/astring_sub.cmo src/astring_string.cmo src/astring.cmo -o src/astring.cma
- + ocamlfind ocamldep -package compiler-libs.toplevel -modules src/astring_top.ml > src/astring_top.ml.depends
- + ocamlfind ocamlc -c -g -bin-annot -safe-string -package compiler-libs.toplevel -I src -I test -o src/astring_top.cmo src/astring_top.ml
- + ocamlfind ocamlc -c -g -bin-annot -safe-string -package compiler-libs.toplevel -I src -I test -o src/astring_top.cmo src/astring_top.ml
- findlib: [WARNING] Interface opttopdirs.cmi occurs in several directories: /home/opam/.opam/5.2.0+flambda2/lib/ocaml, /home/opam/.opam/5.2.0+flambda2/lib/ocaml/compiler-libs
- findlib: [WARNING] Interface topdirs.cmi occurs in several directories: /home/opam/.opam/5.2.0+flambda2/lib/ocaml, /home/opam/.opam/5.2.0+flambda2/lib/ocaml/compiler-libs
- + ocamlfind ocamlopt -c -g -bin-annot -safe-string -package compiler-libs.toplevel -I src -I test -o src/astring_top.cmx src/astring_top.ml
- + ocamlfind ocamlopt -c -g -bin-annot -safe-string -package compiler-libs.toplevel -I src -I test -o src/astring_top.cmx src/astring_top.ml
- findlib: [WARNING] Interface opttopdirs.cmi occurs in several directories: /home/opam/.opam/5.2.0+flambda2/lib/ocaml, /home/opam/.opam/5.2.0+flambda2/lib/ocaml/compiler-libs
- findlib: [WARNING] Interface topdirs.cmi occurs in several directories: /home/opam/.opam/5.2.0+flambda2/lib/ocaml, /home/opam/.opam/5.2.0+flambda2/lib/ocaml/compiler-libs
- File "_none_", line 1:
- Warning 58 [no-cmx-file]: no cmx file was found in path for module Toploop, and its interface was not compiled with -opaque
- + ocamlfind ocamlopt -a -package compiler-libs.toplevel -I src src/astring_top.cmx -o src/astring_top.cmxa
- + ocamlfind ocamlopt -a -package compiler-libs.toplevel -I src src/astring_top.cmx -o src/astring_top.cmxa
- findlib: [WARNING] Interface opttopdirs.cmi occurs in several directories: /home/opam/.opam/5.2.0+flambda2/lib/ocaml, /home/opam/.opam/5.2.0+flambda2/lib/ocaml/compiler-libs
- findlib: [WARNING] Interface topdirs.cmi occurs in several directories: /home/opam/.opam/5.2.0+flambda2/lib/ocaml, /home/opam/.opam/5.2.0+flambda2/lib/ocaml/compiler-libs
- + ocamlfind ocamlopt -shared -linkall -package compiler-libs.toplevel -I src src/astring_top.cmxa -o src/astring_top.cmxs
- + ocamlfind ocamlopt -shared -linkall -package compiler-libs.toplevel -I src src/astring_top.cmxa -o src/astring_top.cmxs
- findlib: [WARNING] Interface opttopdirs.cmi occurs in several directories: /home/opam/.opam/5.2.0+flambda2/lib/ocaml, /home/opam/.opam/5.2.0+flambda2/lib/ocaml/compiler-libs
- findlib: [WARNING] Interface topdirs.cmi occurs in several directories: /home/opam/.opam/5.2.0+flambda2/lib/ocaml, /home/opam/.opam/5.2.0+flambda2/lib/ocaml/compiler-libs
- + ocamlfind ocamlc -a -package compiler-libs.toplevel -I src src/astring_top.cmo -o src/astring_top.cma
- + ocamlfind ocamlc -a -package compiler-libs.toplevel -I src src/astring_top.cmo -o src/astring_top.cma
- findlib: [WARNING] Interface opttopdirs.cmi occurs in several directories: /home/opam/.opam/5.2.0+flambda2/lib/ocaml, /home/opam/.opam/5.2.0+flambda2/lib/ocaml/compiler-libs
- findlib: [WARNING] Interface topdirs.cmi occurs in several directories: /home/opam/.opam/5.2.0+flambda2/lib/ocaml, /home/opam/.opam/5.2.0+flambda2/lib/ocaml/compiler-libs
- # No parallelism done
-> compiled  astring.0.8.5
Processing 31/41: [bigarray-compat: dune build] [dune-configurator: rm] [stdlib-shims: dune build]
-> installed astring.0.8.5
Processing 32/41: [bigarray-compat: dune build] [dune-configurator: rm] [stdlib-shims: dune build]
+ /home/opam/.opam/opam-init/hooks/sandbox.sh "build" "dune" "build" "-p" "bigarray-compat" "-j" "71" (CWD=/home/opam/.opam/5.2.0+flambda2/.opam-switch/build/bigarray-compat.1.1.0)
-> compiled  bigarray-compat.1.1.0
Processing 32/41: [dune-configurator: rm] [stdlib-shims: dune build]
-> installed bigarray-compat.1.1.0
Processing 33/41: [dune-configurator: rm] [stdlib-shims: dune build]
+ /home/opam/.opam/opam-init/hooks/sandbox.sh "build" "dune" "build" "-p" "stdlib-shims" "-j" "71" (CWD=/home/opam/.opam/5.2.0+flambda2/.opam-switch/build/stdlib-shims.0.3.0)
-> compiled  stdlib-shims.0.3.0
Processing 33/41: [dune-configurator: rm]
-> installed stdlib-shims.0.3.0
Processing 34/41: [dune-configurator: rm]
Processing 35/41: [dune-configurator: rm] [integers: dune build]
+ /home/opam/.opam/opam-init/hooks/sandbox.sh "build" "rm" "-rf" "vendor/csexp" (CWD=/home/opam/.opam/5.2.0+flambda2/.opam-switch/build/dune-configurator.3.19.1)
+ /home/opam/.opam/opam-init/hooks/sandbox.sh "build" "rm" "-rf" "vendor/pp" (CWD=/home/opam/.opam/5.2.0+flambda2/.opam-switch/build/dune-configurator.3.19.1)
Processing 35/41: [dune-configurator: dune build] [integers: dune build]
+ /home/opam/.opam/opam-init/hooks/sandbox.sh "build" "dune" "build" "-p" "integers" "-j" "71" (CWD=/home/opam/.opam/5.2.0+flambda2/.opam-switch/build/integers.0.7.0)
-> compiled  integers.0.7.0
Processing 35/41: [dune-configurator: dune build]
-> installed integers.0.7.0
Processing 36/41: [dune-configurator: dune build]
+ /home/opam/.opam/opam-init/hooks/sandbox.sh "build" "dune" "build" "-p" "dune-configurator" "-j" "71" "@install" (CWD=/home/opam/.opam/5.2.0+flambda2/.opam-switch/build/dune-configurator.3.19.1)
-> compiled  dune-configurator.3.19.1
-> installed dune-configurator.3.19.1
Processing 38/41: [ctypes: dune build]
+ /home/opam/.opam/opam-init/hooks/sandbox.sh "build" "dune" "build" "-p" "ctypes" "-j" "71" "--promote-install-files=false" "@install" (CWD=/home/opam/.opam/5.2.0+flambda2/.opam-switch/build/ctypes.0.23.0)
- (cd _build/default && /home/opam/.opam/5.2.0+flambda2/bin/ocamlc.opt -w -40 -g -bin-annot -bin-annot-occurrences -I src/ctypes/.ctypes.objs/byte -I /home/opam/.opam/5.2.0+flambda2/lib/bigarray-compat -I /home/opam/.opam/5.2.0+flambda2/lib/integers -I /home/opam/.opam/5.2.0+flambda2/lib/stdlib-shims -intf-suffix .ml -no-alias-deps -o src/ctypes/.ctypes.objs/byte/ctypes_coerce.cmo -c -impl src/ctypes/ctypes_coerce.ml)
- File "src/ctypes/ctypes_coerce.ml", line 31, characters 9-34:
- 31 | let () = Printexc.register_printer show_uncoercible
-               ^^^^^^^^^^^^^^^^^^^^^^^^^
- Alert unsafe_multidomain: Stdlib.Printexc.register_printer
- Use [Printexc.Safe.register_printer].
- (cd _build/default && /home/opam/.opam/5.2.0+flambda2/bin/ocamlopt.opt -w -40 -g -I src/ctypes/.ctypes.objs/byte -I src/ctypes/.ctypes.objs/native -I /home/opam/.opam/5.2.0+flambda2/lib/bigarray-compat -I /home/opam/.opam/5.2.0+flambda2/lib/integers -I /home/opam/.opam/5.2.0+flambda2/lib/stdlib-shims -intf-suffix .ml -no-alias-deps -o src/ctypes/.ctypes.objs/native/ctypes_coerce.cmx -c -impl src/ctypes/ctypes_coerce.ml)
- File "src/ctypes/ctypes_coerce.ml", line 31, characters 9-34:
- 31 | let () = Printexc.register_printer show_uncoercible
-               ^^^^^^^^^^^^^^^^^^^^^^^^^
- Alert unsafe_multidomain: Stdlib.Printexc.register_printer
- Use [Printexc.Safe.register_printer].
- (cd _build/default && /home/opam/.opam/5.2.0+flambda2/bin/ocamlopt.opt -w -40 -g -I src/ctypes-top/.ctypes_top.objs/byte -I src/ctypes-top/.ctypes_top.objs/native -I /home/opam/.opam/5.2.0+flambda2/lib/bigarray-compat -I /home/opam/.opam/5.2.0+flambda2/lib/integers -I /home/opam/.opam/5.2.0+flambda2/lib/ocaml/compiler-libs -I /home/opam/.opam/5.2.0+flambda2/lib/stdlib-shims -I src/ctypes/.ctypes.objs/byte -I src/ctypes/.ctypes.objs/native -intf-suffix .ml -no-alias-deps -open Ctypes_top -o src/ctypes-top/.ctypes_top.objs/native/ctypes_top__Install_ctypes_printers.cmx -c -impl src/ctypes-top/install_ctypes_printers.ml)
- File "_none_", line 1:
- Warning 58 [no-cmx-file]: no cmx file was found in path for module Toploop, and its interface was not compiled with -opaque
Processing 38/41: [ctypes: dune install]
+ /home/opam/.opam/opam-init/hooks/sandbox.sh "build" "dune" "install" "-p" "ctypes" "--create-install-files" "ctypes" (CWD=/home/opam/.opam/5.2.0+flambda2/.opam-switch/build/ctypes.0.23.0)
-> compiled  ctypes.0.23.0
-> installed ctypes.0.23.0
Processing 40/41: [ahrocksdb: dune build]
+ /home/opam/.opam/opam-init/hooks/sandbox.sh "build" "dune" "build" "-p" "ahrocksdb" "-j" "71" (CWD=/home/opam/.opam/5.2.0+flambda2/.opam-switch/build/ahrocksdb.0.2.2)
- (cd _build/default && /home/opam/.opam/5.2.0+flambda2/bin/ocamlc.opt -w -40 -w no-unused-parameter -g -bin-annot -bin-annot-occurrences -I ffi/bindings/.rocksdb_bindings.objs/byte -I /home/opam/.opam/5.2.0+flambda2/lib/bigarray-compat -I /home/opam/.opam/5.2.0+flambda2/lib/ctypes -I /home/opam/.opam/5.2.0+flambda2/lib/ctypes/stubs -I /home/opam/.opam/5.2.0+flambda2/lib/integers -I /home/opam/.opam/5.2.0+flambda2/lib/ocaml/str -I /home/opam/.opam/5.2.0+flambda2/lib/stdlib-shims -I ffi/structs/.rocksdb_types.objs/byte -no-alias-deps -open Rocksdb_bindings__ -o ffi/bindings/.rocksdb_bindings.objs/byte/rocksdb_bindings__Views.cmo -c -impl ffi/bindings/views.ml)
- File "_none_", line 1:
- Alert ocaml_deprecated_cli: Setting a warning with a sequence of lowercase or uppercase letters,
- like 'arameter', is deprecated.
- Use the equivalent signed form: -n-o-u-n-u-s-e-d-p-a-r-a-m-e-t-e-r.
- Hint: Enabling or disabling a warning by its mnemonic name requires a + or - prefix.
- Hint: Did you make a spelling mistake when using a mnemonic name?
- (cd _build/default && /home/opam/.opam/5.2.0+flambda2/bin/ocamlopt.opt -w -40 -w no-unused-parameter -g -I ffi/bindings/.rocksdb_bindings.objs/byte -I ffi/bindings/.rocksdb_bindings.objs/native -I /home/opam/.opam/5.2.0+flambda2/lib/bigarray-compat -I /home/opam/.opam/5.2.0+flambda2/lib/ctypes -I /home/opam/.opam/5.2.0+flambda2/lib/ctypes/stubs -I /home/opam/.opam/5.2.0+flambda2/lib/integers -I /home/opam/.opam/5.2.0+flambda2/lib/ocaml/str -I /home/opam/.opam/5.2.0+flambda2/lib/stdlib-shims -I ffi/structs/.rocksdb_types.objs/byte -I ffi/structs/.rocksdb_types.objs/native -intf-suffix .ml -no-alias-deps -open Rocksdb_bindings__ -o ffi/bindings/.rocksdb_bindings.objs/native/rocksdb_bindings__Views.cmx -c -impl ffi/bindings/views.ml)
- File "_none_", line 1:
- Alert ocaml_deprecated_cli: Setting a warning with a sequence of lowercase or uppercase letters,
- like 'arameter', is deprecated.
- Use the equivalent signed form: -n-o-u-n-u-s-e-d-p-a-r-a-m-e-t-e-r.
- Hint: Enabling or disabling a warning by its mnemonic name requires a + or - prefix.
- Hint: Did you make a spelling mistake when using a mnemonic name?
- File "ffi/lib/dune", lines 23-26, characters 0-155:
- 23 | (rule
- 24 |  (targets c_flags.sexp c_library_flags.sexp c_flags.txt c_library_flags.txt)
- 25 |  (deps    (:discover config/discover.exe))
- 26 |  (action  (run %{discover})))
- (cd _build/default/ffi/lib && config/discover.exe)
- failed to find an include path for RocksDB: are development headers installed on your system ?
- tested paths: /usr/local/include/rocksdb /usr/include/rocksdb
- compiling c program:
-  | 
-  | 
-  | #include <c.h>
-  | #include <version.h>
-  | 
-  | int main() {
-  |   rocksdb_options_t* opt = rocksdb_options_create();
-  |   rocksdb_options_destroy(opt);
-  |   return 0;
-  | };
-  | 
- run: gcc  -O2 -fno-strict-aliasing -fwrapv -pthread -fPIC  -pthread -I/usr/local/include/rocksdb -I /home/opam/.opam/5.2.0+flambda2/lib/ocaml -o /opam-tmp/build_c0ebde_dune/ocaml-configurator87286b/c-test-0/test.exe /opam-tmp/build_c0ebde_dune/ocaml-configurator87286b/c-test-0/test.c -lm -lpthread -lrocksdb
- -> process exited with code 1
- -> stdout:
- -> stderr:
-  | /opam-tmp/build_c0ebde_dune/ocaml-configurator87286b/c-test-0/test.c:3:10: fatal error: c.h: No such file or directory
-  |     3 | #include <c.h>
-  |       |          ^~~~~
-  | compilation terminated.
- compiling c program:
-  | 
-  | 
-  | #include <c.h>
-  | #include <version.h>
-  | 
-  | int main() {
-  |   rocksdb_options_t* opt = rocksdb_options_create();
-  |   rocksdb_options_destroy(opt);
-  |   return 0;
-  | };
-  | 
- run: gcc  -O2 -fno-strict-aliasing -fwrapv -pthread -fPIC  -pthread -I/usr/include/rocksdb -I /home/opam/.opam/5.2.0+flambda2/lib/ocaml -o /opam-tmp/build_c0ebde_dune/ocaml-configurator87286b/c-test-2/test.exe /opam-tmp/build_c0ebde_dune/ocaml-configurator87286b/c-test-2/test.c -lm -lpthread -lrocksdb
- -> process exited with code 1
- -> stdout:
- -> stderr:
-  | In file included from /opam-tmp/build_c0ebde_dune/ocaml-configurator87286b/c-test-2/test.c:4:
-  | /usr/include/rocksdb/version.h:7:10: fatal error: string: No such file or directory
-  |     7 | #include <string>
-  |       |          ^~~~~~~~
-  | compilation terminated.
- Error: discover error
[ERROR] The compilation of ahrocksdb.0.2.2 failed at "dune build -p ahrocksdb -j 71".

#=== ERROR while compiling ahrocksdb.0.2.2 ====================================#
# context              2.4.1 | linux/x86_64 | ocaml-variants.5.2.0+ox | file:///home/opam/opam-repository
# path                 ~/.opam/5.2.0+flambda2/.opam-switch/build/ahrocksdb.0.2.2
# command              ~/.opam/opam-init/hooks/sandbox.sh build dune build -p ahrocksdb -j 71
# exit-code            1
# env-file             ~/.opam/log/ahrocksdb-8-41e1d8.env
# output-file          ~/.opam/log/ahrocksdb-8-41e1d8.out
### output ###
# (cd _build/default && /home/opam/.opam/5.2.0+flambda2/bin/ocamlc.opt -w -40 -w no-unused-parameter -g -bin-annot -bin-annot-occurrences -I ffi/bindings/.rocksdb_bindings.objs/byte -I /home/opam/.opam/5.2.0+flambda2/lib/bigarray-compat -I /home/opam/.opam/5.2.0+flambda2/lib/ctypes -I /home/opam/.opam/5.2.0+flambda2/lib/ctypes/stubs -I /home/opam/.opam/5.2.0+flambda2/lib/integers -I /home/opam/.opam/5.2.0+flambda2/lib/ocaml/str -I /home/opam/.opam/5.2.0+flambda2/lib/stdlib-shims -I ffi/structs/.rocksdb_types.objs/byte -no-alias-deps -open Rocksdb_bindings__ -o ffi/bindings/.rocksdb_bindings.objs/byte/rocksdb_bindings__Views.cmo -c -impl ffi/bindings/views.ml)
# File "_none_", line 1:
# Alert ocaml_deprecated_cli: Setting a warning with a sequence of lowercase or uppercase letters,
# like 'arameter', is deprecated.
# Use the equivalent signed form: -n-o-u-n-u-s-e-d-p-a-r-a-m-e-t-e-r.
# Hint: Enabling or disabling a warning by its mnemonic name requires a + or - prefix.
# Hint: Did you make a spelling mistake when using a mnemonic name?
# (cd _build/default && /home/opam/.opam/5.2.0+flambda2/bin/ocamlopt.opt -w -40 -w no-unused-parameter -g -I ffi/bindings/.rocksdb_bindings.objs/byte -I ffi/bindings/.rocksdb_bindings.objs/native -I /home/opam/.opam/5.2.0+flambda2/lib/bigarray-compat -I /home/opam/.opam/5.2.0+flambda2/lib/ctypes -I /home/opam/.opam/5.2.0+flambda2/lib/ctypes/stubs -I /home/opam/.opam/5.2.0+flambda2/lib/integers -I /home/opam/.opam/5.2.0+flambda2/lib/ocaml/str -I /home/opam/.opam/5.2.0+flambda2/lib/stdlib-shims -I ffi/structs/.rocksdb_types.objs/byte -I ffi/structs/.rocksdb_types.objs/native -intf-suffix .ml -no-alias-deps -open Rocksdb_bindings__ -o ffi/bindings/.rocksdb_bindings.objs/native/rocksdb_bindings__Views.cmx -c -impl ffi/bindings/views.ml)
# File "_none_", line 1:
# Alert ocaml_deprecated_cli: Setting a warning with a sequence of lowercase or uppercase letters,
# like 'arameter', is deprecated.
# Use the equivalent signed form: -n-o-u-n-u-s-e-d-p-a-r-a-m-e-t-e-r.
# Hint: Enabling or disabling a warning by its mnemonic name requires a + or - prefix.
# Hint: Did you make a spelling mistake when using a mnemonic name?
# File "ffi/lib/dune", lines 23-26, characters 0-155:
# 23 | (rule
# 24 |  (targets c_flags.sexp c_library_flags.sexp c_flags.txt c_library_flags.txt)
# 25 |  (deps    (:discover config/discover.exe))
# 26 |  (action  (run %{discover})))
# (cd _build/default/ffi/lib && config/discover.exe)
# failed to find an include path for RocksDB: are development headers installed on your system ?
# tested paths: /usr/local/include/rocksdb /usr/include/rocksdb
# compiling c program:
#  | 
#  | 
#  | #include <c.h>
#  | #include <version.h>
#  | 
#  | int main() {
#  |   rocksdb_options_t* opt = rocksdb_options_create();
#  |   rocksdb_options_destroy(opt);
#  |   return 0;
#  | };
#  | 
# run: gcc  -O2 -fno-strict-aliasing -fwrapv -pthread -fPIC  -pthread -I/usr/local/include/rocksdb -I /home/opam/.opam/5.2.0+flambda2/lib/ocaml -o /opam-tmp/build_c0ebde_dune/ocaml-configurator87286b/c-test-0/test.exe /opam-tmp/build_c0ebde_dune/ocaml-configurator87286b/c-test-0/test.c -lm -lpthread -lrocksdb
# -> process exited with code 1
# -> stdout:
# -> stderr:
#  | /opam-tmp/build_c0ebde_dune/ocaml-configurator87286b/c-test-0/test.c:3:10: fatal error: c.h: No such file or directory
#  |     3 | #include <c.h>
#  |       |          ^~~~~
#  | compilation terminated.
# compiling c program:
#  | 
#  | 
#  | #include <c.h>
#  | #include <version.h>
#  | 
#  | int main() {
#  |   rocksdb_options_t* opt = rocksdb_options_create();
#  |   rocksdb_options_destroy(opt);
#  |   return 0;
#  | };
#  | 
# run: gcc  -O2 -fno-strict-aliasing -fwrapv -pthread -fPIC  -pthread -I/usr/include/rocksdb -I /home/opam/.opam/5.2.0+flambda2/lib/ocaml -o /opam-tmp/build_c0ebde_dune/ocaml-configurator87286b/c-test-2/test.exe /opam-tmp/build_c0ebde_dune/ocaml-configurator87286b/c-test-2/test.c -lm -lpthread -lrocksdb
# -> process exited with code 1
# -> stdout:
# -> stderr:
#  | In file included from /opam-tmp/build_c0ebde_dune/ocaml-configurator87286b/c-test-2/test.c:4:
#  | /usr/include/rocksdb/version.h:7:10: fatal error: string: No such file or directory
#  |     7 | #include <string>
#  |       |          ^~~~~~~~
#  | compilation terminated.
# Error: discover error



<><> Error report <><><><><><><><><><><><><><><><><><><><><><><><><><><><><><><>
+- The following actions failed
| - build ahrocksdb 0.2.2
+- 
+- The following changes have been performed
| - install astring           0.8.5
| - install bigarray-compat   1.1.0
| - install conf-rocksdb      1
| - install csexp             1.5.2
| - install ctypes            0.23.0
| - install dune              3.19.1
| - install dune-configurator 3.19.1
| - install integers          0.7.0
| - install ocamlbuild        0.15.0+ox
| - install ocamlfind         1.9.8
| - install rresult           0.7.0
| - install stdlib-shims      0.3.0
| - install topkg             1.0.8+ox
+- 
# To update the current shell environment, run: eval $(opam env)

The former state can be restored with:
    /usr/bin/opam switch import "/home/opam/.opam/5.2.0+flambda2/.opam-switch/backup/state-20250807074229.export"
'opam install -vy ahrocksdb.0.2.2' failed.
"/usr/bin/env" "bash" "-c" "opam remove -y ahrocksdb.0.2.2
opam install -vy ahrocksdb.0.2.2
res=$?
if [ $res = 31 ]; then
    if opam show -f x-ci-accept-failures: ahrocksdb.0.2.2 | grep -q 'debian-unstable'; then
        echo "This package failed and has been disabled for CI using the 'x-ci-accept-failures' field."
        exit 69
    fi
fi 


exit $res" failed with exit status 31
Failed: Build failed